program: Orca
programVersion: 5.0.2
elementType: Cl F F F O O O O O O N N C C C C C C C C C C C C C C C C C C C C H H H H H H H H H H H H H H H H H H
charge: 0
multiplicity: 1
keywords: wb97x-d3
keywords: def2-TZVPP
keywords: def2/J RIJCOSX
keywords: DEFGRID2
keywords: scfconv7
keywords: smallprint printgap noloewdin
keywords: NOSOSCF
formula: C20H18ClF3N2O6
InChI: InChI=1/C20H18ClF3N2O6/c1-5-8-31-17(29)19(2,3)32-16(28)12-9-11(6-7-13(12)21)26-15(27)10-14(20(22,23)24)25(4)18(26)30/h5-7,9-10H,1,8H2,2-4H3
50 atoms
Cl 3.350941 -3.080483 -0.271467
F  -6.149632 1.78966 -0.498055
F  -6.697719 0.150535 -1.761239
F  -6.875454 -0.05149 0.362881
O  3.691748 -0.249161 -0.120591
O  3.437514 1.943811 1.314124
O  -1.976515 -0.162395 1.660554
O  -2.370101 -1.879229 -2.504214
O  4.69574 3.121011 -0.115696
O  2.286924 1.053644 -1.259402
N  -2.192992 -1.030614 -0.409658
N  -3.956796 0.164147 0.581695
C  4.759823 0.71369 -0.211663
C  -0.84812 -1.50209 -0.332793
C  -4.702929 -0.072879 -0.547088
C  -2.670595 -0.327302 0.680597
C  5.306142 0.805081 -1.626503
C  5.832666 0.195043 0.739766
C  1.515571 -1.048853 -0.494134
C  0.190766 -0.621283 -0.545403
C  -2.889998 -1.277855 -1.584051
C  -4.233793 -0.764406 -1.595709
C  4.281749 2.070917 0.303733
C  -0.592817 -2.837658 -0.076977
C  2.533716 0.018731 -0.685763
C  1.765173 -2.404296 -0.259729
C  -4.441513 0.979122 1.702337
C  0.714471 -3.287598 -0.05511
C  -6.119222 0.461814 -0.607472
C  2.932821 3.127465 1.933527
C  3.861903 3.71149 2.942359
C  5.024066 3.213101 3.341095
H  5.549188 -0.195413 -1.983778
H  4.61692 1.26608 -2.329943
H  6.2282 1.384099 -1.629564
H  6.665589 0.895732 0.776161
H  5.451736 0.0590 1.751396
H  6.213879 -0.760685 0.379775
H  -0.025706 0.419915 -0.743589
H  -4.827175 -0.950688 -2.476141
H  -1.403362 -3.532896 0.095432
H  -5.377625 0.593805 2.091855
H  -3.715278 0.933116 2.502431
H  -4.550526 2.018646 1.407269
H  0.916656 -4.334834 0.120216
H  2.004664 2.822213 2.419217
H  2.664957 3.872683 1.180748
H  3.492704 4.63265 3.381814
H  5.609127 3.724236 4.093794
H  5.446009 2.295014 2.95094
elementType: Cl F O N C H
totalener: -2093.80502026 hartree
nucrepener: 3506.03477017 hartree
electener: -5599.83979043 hartree
oneelecener: -9849.42288052 hartree
twoeener: 4249.58309009 hartree
cpcmener: -0.05762030 hartree
kineticenergy: 2086.83034136 hartree
xcener: -168.856868187716 hartree
chargesum: -0.0000000
charge: -0.054767 -0.161166 -0.159698 -0.161673 -0.284448 -0.274302 -0.494020 -0.497801 -0.448096 -0.464923 -0.050789 -0.090396 0.347782 0.037172 0.010557 0.421372 -0.309998 -0.318428 0.032827 -0.112000 0.370407 -0.146351 0.313487 -0.173337 0.475856 0.031087 -0.203772 -0.102553 0.538685 0.090677 -0.189285 -0.275040 0.113590 0.114529 0.111754 0.117525 0.117646 0.118971 0.141759 0.139379 0.158812 0.140347 0.115684 0.141565 0.140373 0.123882 0.108897 0.138829 0.133901 0.125492
qa: -0.0548 -0.1612 -0.1597 -0.1617 -0.2844 -0.2743 -0.4940 -0.4978 -0.4481 -0.4649 -0.0508 -0.0904 0.3478 0.0372 0.0106 0.4214 -0.3100 -0.3184 0.0328 -0.1120 0.3704 -0.1464 0.3135 -0.1733 0.4759 0.0311 -0.2038 -0.1026 0.5387 0.0907 -0.1893 -0.2750 0.1136 0.1145 0.1118 0.1175 0.1176 0.1190 0.1418 0.1394 0.1588 0.1403 0.1157 0.1416 0.1404 0.1239 0.1089 0.1388 0.1339 0.1255
va: 1.2597 1.1475 1.1511 1.1476 2.1752 2.1416 2.0209 2.0048 2.0559 2.0375 3.1232 3.3577 3.7613 3.6725 3.9893 4.2218 3.9350 3.9205 3.7001 4.0966 4.1817 3.8856 4.2033 4.1150 4.0853 3.9775 3.8377 3.9786 4.4090 3.8306 3.8252 3.9316 1.0054 1.0146 1.0077 1.0042 1.0090 1.0051 1.0347 1.0211 1.0016 0.9974 1.0245 0.9911 1.0099 0.9967 1.0109 1.0006 1.0027 1.0000
dispcorr: -0.027764933 hartree
energy: -2093.832785194951
dipole: 46.78791 -48.63555 -1.84764 16.51095 -16.95329 -0.44234 15.48138 -13.48714 1.99424
magnitude: 2.75434 au
magnitude: 7.00099 debye
