program: Orca
programVersion: 5.0.2
elementType: Cl F F F O O O O O O N N C C C C C C C C C C C C C C C C C C C C H H H H H H H H H H H H H H H H H H
charge: 0
multiplicity: 1
keywords: wb97x-d3
keywords: def2-TZVPP
keywords: def2/J RIJCOSX
keywords: DEFGRID2
keywords: scfconv7
keywords: smallprint printgap noloewdin
keywords: NOSOSCF
formula: C20H18ClF3N2O6
InChI: InChI=1/C20H18ClF3N2O6/c1-5-8-31-17(29)19(2,3)32-16(28)12-9-11(6-7-13(12)21)26-15(27)10-14(20(22,23)24)25(4)18(26)30/h5-7,9-10H,1,8H2,2-4H3
50 atoms
Cl 3.444938 -3.139409 -0.745908
F  -5.985173 1.904069 -0.848798
F  -6.729564 -0.091296 -0.601658
F  -6.209907 1.101801 1.120724
O  3.980061 -0.487883 0.178827
O  3.888424 2.031268 -0.561364
O  -2.425973 -2.165188 1.32155
O  -1.386928 0.820894 -1.912889
O  4.898316 2.670581 1.338718
O  2.532007 0.488628 1.561966
N  -1.938494 -0.725218 -0.347245
N  -4.094483 -0.806352 0.586008
C  5.056103 0.369806 0.616724
C  -0.631181 -1.291956 -0.427917
C  -4.438524 0.265888 -0.198815
C  -2.80135 -1.287552 0.574578
C  6.171494 0.154176 -0.39939
C  5.526872 -0.004078 2.010308
C  1.725512 -1.158344 0.070666
C  0.430926 -0.649652 0.170649
C  -2.227913 0.359001 -1.164579
C  -3.573592 0.85272 -1.040713
C  4.590263 1.826284 0.536865
C  -0.434023 -2.469497 -1.128137
C  2.781691 -0.319512 0.697673
C  1.912819 -2.358139 -0.620726
C  -5.000918 -1.437041 1.552533
C  0.836673 -3.007319 -1.209619
C  -5.855255 0.799053 -0.126507
C  3.158273 3.256841 -0.7619
C  1.707481 2.91659 -0.841576
C  0.783313 3.461211 -0.061463
H  7.007504 0.815443 -0.175266
H  6.532253 -0.872907 -0.341791
H  5.84245 0.350053 -1.419133
H  6.437582 0.542742 2.251221
H  4.79381 0.202487 2.786737
H  5.76958 -1.06632 2.035267
H  0.260487 0.272394 0.710262
H  -3.849899 1.693555 -1.656353
H  -1.263269 -2.974476 -1.605345
H  -4.980738 -0.916414 2.507539
H  -6.013355 -1.477489 1.170792
H  -4.68702 -2.46239 1.707393
H  0.989842 -3.937613 -1.738227
H  3.518684 3.67388 -1.703269
H  3.361405 3.975603 0.031286
H  1.418931 2.191825 -1.59705
H  -0.26316 3.20512 -0.167258
H  1.03441 4.187371 0.702671
elementType: Cl F O N C H
totalener: -2093.80357348 hartree
nucrepener: 3575.55814305 hartree
electener: -5669.36171653 hartree
oneelecener: -9988.88078022 hartree
twoeener: 4319.51906370 hartree
cpcmener: -0.05606560 hartree
kineticenergy: 2086.81663055 hartree
xcener: -168.851708940921 hartree
chargesum: 0.0000000
charge: -0.054260 -0.158449 -0.162265 -0.160570 -0.277882 -0.268244 -0.496401 -0.502290 -0.453435 -0.458357 -0.045457 -0.098176 0.297838 0.059183 0.017944 0.429498 -0.294453 -0.308349 0.094522 -0.166194 0.369678 -0.151933 0.355129 -0.175535 0.449816 0.017380 -0.187834 -0.100943 0.534894 0.081447 -0.194209 -0.239939 0.113470 0.111162 0.115524 0.110794 0.113242 0.111738 0.145453 0.138998 0.157572 0.142483 0.129261 0.115684 0.141666 0.113346 0.101130 0.133186 0.128270 0.124866
qa: -0.0543 -0.1584 -0.1623 -0.1606 -0.2779 -0.2682 -0.4964 -0.5023 -0.4534 -0.4584 -0.0455 -0.0982 0.2978 0.0592 0.0179 0.4295 -0.2945 -0.3083 0.0945 -0.1662 0.3697 -0.1519 0.3551 -0.1755 0.4498 0.0174 -0.1878 -0.1009 0.5349 0.0814 -0.1942 -0.2399 0.1135 0.1112 0.1155 0.1108 0.1132 0.1117 0.1455 0.1390 0.1576 0.1425 0.1293 0.1157 0.1417 0.1133 0.1011 0.1332 0.1283 0.1249
va: 1.2604 1.1522 1.1451 1.1512 2.1750 2.1402 2.0137 1.9918 2.0611 2.0412 3.1305 3.3782 3.7842 3.6554 3.9732 4.2114 3.9222 3.9366 3.6115 4.1092 4.1655 3.8951 4.2059 4.1209 4.1207 3.9970 3.8581 3.9718 4.4219 3.8344 3.8169 3.9252 1.0054 1.0030 1.0129 1.0073 1.0153 1.0056 1.0270 1.0220 1.0015 0.9872 1.0070 1.0110 1.0093 0.9929 1.0240 1.0107 1.0055 1.0078
dispcorr: -0.029771220 hartree
energy: -2093.833344699942
dipole: 37.22722 -39.42209 -2.19487 8.84779 -9.89809 -1.05029 5.05436 -6.09936 -1.04501
magnitude: 2.64813 au
magnitude: 6.73102 debye
