program: Orca
programVersion: 5.0.2
elementType: Cl F F F O O O O O O N N C C C C C C C C C C C C C C C C C C C C H H H H H H H H H H H H H H H H H H
charge: 0
multiplicity: 1
keywords: wb97x-d3
keywords: def2-TZVPP
keywords: def2/J RIJCOSX
keywords: DEFGRID2
keywords: scfconv7
keywords: smallprint printgap noloewdin
keywords: NOSOSCF
formula: C20H18ClF3N2O6
InChI: InChI=1/C20H18ClF3N2O6/c1-5-8-31-17(29)19(2,3)32-16(28)12-9-11(6-7-13(12)21)26-15(27)10-14(20(22,23)24)25(4)18(26)30/h5-7,9-10H,1,8H2,2-4H3
50 atoms
Cl 3.212604 -2.350331 -1.479584
F  -6.974046 0.767053 -0.582511
F  -7.274323 -1.21879 0.158994
F  -6.669581 0.362486 1.499067
O  3.357978 -0.298019 0.524356
O  5.09327 2.756816 0.485068
O  -2.401608 -2.2293 1.444419
O  -2.477898 0.245156 -2.339051
O  4.541148 1.438931 -1.229632
O  1.948973 1.411571 0.244763
N  -2.452385 -1.004171 -0.447947
N  -4.387816 -1.292467 0.854427
C  4.419481 0.545763 1.003181
C  -1.076715 -1.321438 -0.660842
C  -5.051192 -0.452635 -0.006002
C  -3.043196 -1.552081 0.674035
C  5.654004 -0.350126 1.015869
C  4.115555 1.058603 2.401765
C  1.252798 -0.757787 -0.397507
C  -0.096428 -0.465991 -0.203986
C  -3.079851 -0.18352 -1.377619
C  -4.46334 0.093984 -1.080535
C  4.660515 1.633548 -0.047722
C  -0.738068 -2.478186 -1.34106
C  2.217217 0.240106 0.142751
C  1.586304 -1.922643 -1.093374
C  -4.998765 -1.890461 2.045764
C  0.593894 -2.772518 -1.561911
C  -6.506241 -0.133421 0.27229
C  5.412287 3.838406 -0.412244
C  5.771926 5.01642 0.423616
C  6.910333 5.682926 0.290338
H  6.527982 0.221732 1.326482
H  5.518294 -1.166731 1.725559
H  5.853887 -0.774228 0.032104
H  4.995785 1.536418 2.829233
H  3.294914 1.772152 2.43225
H  3.862303 0.215162 3.044951
H  -0.377621 0.436802 0.322573
H  -4.990529 0.748802 -1.755956
H  -1.506971 -3.146385 -1.706151
H  -6.018779 -2.198486 1.850846
H  -4.44617 -2.784587 2.308133
H  -4.968711 -1.203722 2.889257
H  0.86228 -3.666174 -2.107954
H  4.536908 4.058041 -1.029415
H  6.233517 3.548827 -1.071034
H  5.025387 5.348718 1.138764
H  7.120534 6.563799 0.883055
H  7.671878 5.378181 -0.418219
elementType: Cl F O N C H
totalener: -2093.81548140 hartree
nucrepener: 3435.36838803 hartree
electener: -5529.18386942 hartree
oneelecener: -9708.89819673 hartree
twoeener: 4179.71432731 hartree
cpcmener: -0.04773577 hartree
kineticenergy: 2086.82706096 hartree
xcener: -168.846898325236 hartree
chargesum: 0.0000000
charge: -0.056356 -0.158057 -0.162088 -0.161330 -0.277710 -0.265015 -0.470175 -0.462967 -0.436784 -0.438930 -0.053955 -0.103378 0.323448 0.040361 0.006083 0.410348 -0.295759 -0.304030 0.049256 -0.106445 0.352866 -0.157330 0.333672 -0.172418 0.431316 0.043972 -0.196222 -0.109997 0.537395 0.086074 -0.212366 -0.244815 0.114733 0.112961 0.114451 0.103945 0.113754 0.110063 0.136352 0.138587 0.150608 0.132544 0.116684 0.140008 0.137919 0.111156 0.106716 0.140717 0.131106 0.119034
qa: -0.0564 -0.1581 -0.1621 -0.1613 -0.2777 -0.2650 -0.4702 -0.4630 -0.4368 -0.4389 -0.0540 -0.1034 0.3234 0.0404 0.0061 0.4103 -0.2958 -0.3040 0.0493 -0.1064 0.3529 -0.1573 0.3337 -0.1724 0.4313 0.0440 -0.1962 -0.1100 0.5374 0.0861 -0.2124 -0.2448 0.1147 0.1130 0.1145 0.1039 0.1138 0.1101 0.1364 0.1386 0.1506 0.1325 0.1167 0.1400 0.1379 0.1112 0.1067 0.1407 0.1311 0.1190
va: 1.2594 1.1529 1.1450 1.1488 2.1758 2.1649 2.0455 2.0483 2.0725 2.0630 3.0951 3.3609 3.7854 3.6485 3.9771 4.2390 3.9298 3.9361 3.6749 4.1206 4.2160 3.8722 4.1860 4.1243 4.1482 3.9720 3.8559 3.9920 4.4155 3.8231 3.8826 3.9477 1.0069 1.0035 1.0118 1.0100 1.0172 1.0041 1.0329 1.0218 1.0049 1.0053 1.0135 0.9875 1.0115 0.9960 1.0034 1.0030 1.0022 1.0091
dispcorr: -0.026488999 hartree
energy: -2093.841970397018
dipole: 52.39074 -53.28828 -0.89755 17.32287 -17.84244 -0.51957 13.60399 -11.68642 1.91757
magnitude: 2.18005 au
magnitude: 5.54125 debye
