program: Orca
programVersion: 5.0.2
elementType: Cl F F F O O O O O O N N C C C C C C C C C C C C C C C C C C C C H H H H H H H H H H H H H H H H H H
charge: 0
multiplicity: 1
keywords: wb97x-d3
keywords: def2-TZVPP
keywords: def2/J RIJCOSX
keywords: DEFGRID2
keywords: scfconv7
keywords: smallprint printgap noloewdin
keywords: NOSOSCF
formula: C20H18ClF3N2O6
InChI: InChI=1/C20H18ClF3N2O6/c1-5-8-31-17(29)19(2,3)32-16(28)12-9-11(6-7-13(12)21)26-15(27)10-14(20(22,23)24)25(4)18(26)30/h5-7,9-10H,1,8H2,2-4H3
50 atoms
Cl 3.238691 -2.473974 -1.124876
F  -7.16908 -0.38702 -0.20685
F  -6.597185 0.842849 1.473929
F  -6.602394 1.654571 -0.507031
O  2.336698 1.35317 0.255419
O  4.80249 1.421568 -0.74939
O  -2.549573 -2.054692 1.434763
O  -2.041788 0.879811 -1.97254
O  5.638725 2.119118 1.204285
O  3.436899 -0.410294 1.080638
N  -2.306902 -0.608681 -0.282431
N  -4.381441 -0.870203 0.796764
C  3.267905 2.298624 0.819833
C  -0.961441 -1.056408 -0.451684
C  -4.881124 0.141642 0.015087
C  -3.049589 -1.229691 0.704461
C  3.066052 2.425744 2.319306
C  2.959989 3.617722 0.119451
C  1.398772 -0.738954 -0.112794
C  0.084643 -0.311765 0.057848
C  -2.767259 0.390722 -1.132061
C  -4.141064 0.768881 -0.911692
C  4.706259 1.908363 0.472935
C  -0.717377 -2.220936 -1.159222
C  2.508138 0.059304 0.477943
C  1.635487 -1.917421 -0.819002
C  -5.158452 -1.577012 1.819368
C  0.583679 -2.650041 -1.346114
C  -6.325946 0.564739 0.199224
C  6.106098 1.051726 -1.240566
C  6.556278 -0.259591 -0.687758
C  6.723282 -1.339166 -1.440372
H  2.018828 2.647293 2.526528
H  3.345614 1.528223 2.867685
H  3.657073 3.253977 2.707359
H  1.9510 3.947856 0.368795
H  3.654782 4.387694 0.453677
H  3.038801 3.533007 -0.964145
H  -0.123646 0.597581 0.606634
H  -4.538771 1.560804 -1.52577
H  -1.53634 -2.793989 -1.573715
H  -4.737578 -2.567415 1.95335
H  -5.124691 -1.051623 2.77281
H  -6.186487 -1.714206 1.503907
H  0.777186 -3.552756 -1.908702
H  6.821417 1.846081 -1.01659
H  5.987994 0.996718 -2.32168
H  6.767682 -0.307272 0.375249
H  7.067725 -2.273385 -1.015116
H  6.51984 -1.33452 -2.505246
elementType: Cl F O N C H
totalener: -2093.81602960 hartree
nucrepener: 3508.38202091 hartree
electener: -5602.19805051 hartree
oneelecener: -9854.45341803 hartree
twoeener: 4252.25536752 hartree
cpcmener: -0.04858308 hartree
kineticenergy: 2086.80259306 hartree
xcener: -168.842451598171 hartree
chargesum: -0.0000000
charge: -0.060505 -0.161808 -0.161041 -0.158699 -0.285758 -0.268580 -0.468103 -0.463898 -0.436606 -0.411192 -0.057050 -0.103245 0.324963 0.062386 0.008147 0.411299 -0.313610 -0.292252 0.059720 -0.146506 0.348165 -0.156057 0.336773 -0.169151 0.413479 0.060677 -0.189282 -0.124176 0.535884 0.061575 -0.200184 -0.254616 0.112522 0.115202 0.109582 0.110725 0.109090 0.116114 0.140796 0.137601 0.152860 0.116627 0.138998 0.128364 0.140403 0.110861 0.116026 0.147463 0.134843 0.121175
qa: -0.0605 -0.1618 -0.1610 -0.1587 -0.2858 -0.2686 -0.4681 -0.4639 -0.4366 -0.4112 -0.0571 -0.1032 0.3250 0.0624 0.0081 0.4113 -0.3136 -0.2923 0.0597 -0.1465 0.3482 -0.1561 0.3368 -0.1692 0.4135 0.0607 -0.1893 -0.1242 0.5359 0.0616 -0.2002 -0.2546 0.1125 0.1152 0.1096 0.1107 0.1091 0.1161 0.1408 0.1376 0.1529 0.1166 0.1390 0.1284 0.1404 0.1109 0.1160 0.1475 0.1348 0.1212
va: 1.2658 1.1446 1.1498 1.1520 2.1566 2.1442 2.0474 2.0477 2.0774 2.0849 3.1105 3.3621 3.7841 3.6472 3.9760 4.2333 3.9421 3.9240 3.6508 4.1321 4.2156 3.8734 4.2148 4.1078 4.1551 3.9612 3.8608 4.0133 4.4197 3.8380 3.7769 3.9427 1.0033 1.0140 1.0097 1.0030 1.0056 1.0133 1.0278 1.0224 1.0034 1.0110 0.9878 1.0069 1.0104 1.0098 1.0016 1.0076 1.0010 1.0097
dispcorr: -0.028085838 hartree
energy: -2093.844115436231
dipole: 42.50384 -45.47559 -2.97176 9.77531 -9.56708 0.20824 4.53543 -4.95934 -0.42391
magnitude: 3.00905 au
magnitude: 7.64841 debye
