program: Orca
programVersion: 5.0.2
elementType: Cl F F F O O O O O O N N C C C C C C C C C C C C C C C C C C C C H H H H H H H H H H H H H H H H H H
charge: 0
multiplicity: 1
keywords: wb97x-d3
keywords: def2-TZVPP
keywords: def2/J RIJCOSX
keywords: DEFGRID2
keywords: scfconv7
keywords: smallprint printgap noloewdin
keywords: NOSOSCF
formula: C20H18ClF3N2O6
InChI: InChI=1/C20H18ClF3N2O6/c1-5-8-31-17(29)19(2,3)32-16(28)12-9-11(6-7-13(12)21)26-15(27)10-14(20(22,23)24)25(4)18(26)30/h5-7,9-10H,1,8H2,2-4H3
50 atoms
Cl 3.505662 -3.488544 -1.454875
F  -4.959002 2.418932 0.962776
F  -5.806811 1.662227 -0.853324
F  -6.096347 0.583322 0.975258
O  3.320459 -0.431233 0.970194
O  2.483183 1.994345 0.585833
O  -1.620668 -1.427954 1.757872
O  -1.779573 -0.369209 -2.638724
O  4.567759 2.759102 0.294969
O  3.805937 -0.178928 -1.204019
N  -1.706385 -0.902295 -0.435959
N  -3.298143 -0.057402 1.073124
C  4.210361 0.627379 1.389065
C  -0.462646 -1.57284 -0.636432
C  -3.950291 0.517664 0.011745
C  -2.178069 -0.837945 0.860976
C  5.669286 0.280316 1.155997
C  3.931931 0.802018 2.877795
C  1.931606 -1.485656 -0.566143
C  0.699881 -0.903692 -0.308096
C  -2.286734 -0.28847 -1.540502
C  -3.504909 0.423621 -1.249427
C  3.797937 1.915543 0.668546
C  -0.416188 -2.841524 -1.186394
C  3.141439 -0.651066 -0.320745
C  1.978113 -2.750208 -1.135688
C  -3.750659 0.038094 2.464365
C  0.811161 -3.437826 -1.429733
C  -5.216292 1.301458 0.27902
C  1.861614 3.114383 -0.069816
C  0.418871 3.067663 0.306511
C  -0.555865 2.772884 -0.543912
H  5.949416 0.264042 0.105608
H  6.305059 1.00516 1.663324
H  5.882831 -0.697919 1.587709
H  4.516321 1.633913 3.269963
H  2.878994 0.997934 3.078281
H  4.22562 -0.097151 3.420438
H  0.644416 0.088919 0.11955
H  -4.018175 0.883803 -2.078596
H  -1.328699 -3.36884 -1.43122
H  -2.892032 -0.062689 3.117683
H  -4.185405 1.008475 2.669199
H  -4.463618 -0.748812 2.701882
H  0.854606 -4.430811 -1.855074
H  2.001234 3.021993 -1.148814
H  2.324448 4.045431 0.264438
H  0.18521 3.289601 1.343381
H  -1.591587 2.761762 -0.227687
H  -0.360495 2.545756 -1.585644
elementType: Cl F O N C H
totalener: -2093.81288235 hartree
nucrepener: 3644.21793061 hartree
electener: -5738.03081296 hartree
twoeener: 4386.78241325 hartree
cpcmener: -0.04763725 hartree
kineticenergy: 2086.85546650 hartree
xcener: -168.848681315212 hartree
chargesum: 0.0000000
charge: -0.059752 -0.163825 -0.158139 -0.160621 -0.271542 -0.260714 -0.463639 -0.460072 -0.422893 -0.402694 -0.035490 -0.087050 0.313739 0.102335 -0.010645 0.403453 -0.301593 -0.294928 0.095240 -0.168561 0.314021 -0.133574 0.330955 -0.193503 0.330872 0.057681 -0.191670 -0.108152 0.535377 0.065313 -0.197344 -0.255399 0.111925 0.108310 0.112187 0.110083 0.114359 0.112395 0.134911 0.134925 0.150729 0.116418 0.130135 0.139363 0.141713 0.118953 0.115980 0.140249 0.134847 0.125333
qa: -0.0598 -0.1638 -0.1581 -0.1606 -0.2715 -0.2607 -0.4636 -0.4601 -0.4229 -0.4027 -0.0355 -0.0871 0.3137 0.1023 -0.0106 0.4035 -0.3016 -0.2949 0.0952 -0.1686 0.3140 -0.1336 0.3310 -0.1935 0.3309 0.0577 -0.1917 -0.1082 0.5354 0.0653 -0.1973 -0.2554 0.1119 0.1083 0.1122 0.1101 0.1144 0.1124 0.1349 0.1349 0.1507 0.1164 0.1301 0.1394 0.1417 0.1190 0.1160 0.1402 0.1348 0.1253
va: 1.2649 1.1388 1.1537 1.1515 2.1640 2.1345 2.0551 2.0422 2.0949 2.0971 3.0912 3.3395 3.7814 3.6434 3.9576 4.2317 3.9351 3.9271 3.6854 4.1300 4.2023 3.8346 4.1989 4.1055 4.2611 3.9209 3.8590 3.9835 4.4166 3.8194 3.8515 3.9241 1.0184 1.0078 1.0042 1.0050 1.0126 1.0034 1.0374 1.0232 1.0053 1.0113 1.0070 0.9878 1.0071 1.0005 1.0032 1.0039 1.0016 1.0117
dispcorr: -0.031292018 hartree
energy: -2093.844174364318
dipole: 27.01379 -29.91178 -2.89798 11.71575 -11.36235 0.35340 14.98837 -12.68289 2.30548
magnitude: 3.72000 au
magnitude: 9.45550 debye
