program: Orca
programVersion: 5.0.2
elementType: Cl F F F O O O O O O N N C C C C C C C C C C C C C C C C C C C C H H H H H H H H H H H H H H H H H H
charge: 0
multiplicity: 1
keywords: wb97x-d3
keywords: def2-TZVPP
keywords: def2/J RIJCOSX
keywords: DEFGRID2
keywords: scfconv7
keywords: smallprint printgap noloewdin
keywords: NOSOSCF
formula: C20H18ClF3N2O6
InChI: InChI=1/C20H18ClF3N2O6/c1-5-8-31-17(29)19(2,3)32-16(28)12-9-11(6-7-13(12)21)26-15(27)10-14(20(22,23)24)25(4)18(26)30/h5-7,9-10H,1,8H2,2-4H3
50 atoms
Cl 3.240705 -3.151201 -0.361061
F  -6.888225 0.10826 -1.412785
F  -6.927422 0.035824 0.726292
F  -6.18547 1.790579 -0.288174
O  2.183089 0.995164 0.052511
O  5.482935 2.182346 -0.025581
O  -2.080596 -0.504032 1.825064
O  -2.566661 -1.816986 -2.477419
O  4.534245 0.779942 1.436016
O  3.5186 -0.324769 -1.159372
N  -2.309222 -1.11573 -0.336988
N  -4.033758 0.021354 0.788381
C  3.114069 2.09139 0.00402
C  -0.965989 -1.598335 -0.329818
C  -4.817278 -0.12379 -0.329241
C  -2.767609 -0.532268 0.829724
C  2.57606 3.101821 1.011828
C  3.166935 2.704018 -1.386637
C  1.395409 -1.135906 -0.44084
C  0.075144 -0.695285 -0.411995
C  -3.046657 -1.274336 -1.504917
C  -4.384975 -0.742864 -1.437903
C  4.453235 1.580927 0.54322
C  -0.714093 -2.957153 -0.259189
C  2.489337 -0.136801 -0.566462
C  1.641166 -2.509089 -0.378989
C  -4.485107 0.66558 2.025135
C  0.592124 -3.410827 -0.281059
C  -6.218172 0.456122 -0.320641
C  6.789546 1.863465 0.454341
C  7.168404 2.607624 1.689998
C  6.477703 3.569223 2.286389
H  3.24332 3.961027 1.074141
H  1.597164 3.462447 0.693958
H  2.481376 2.667946 2.00735
H  3.720777 3.64144 -1.364997
H  3.62651 2.058214 -2.131413
H  2.152498 2.937016 -1.71255
H  -0.144452 0.362023 -0.476237
H  -5.00235 -0.852983 -2.31501
H  -1.528204 -3.665709 -0.181696
H  -3.618624 1.032039 2.563317
H  -5.108997 1.525951 1.813405
H  -5.018982 -0.037671 2.662151
H  0.793142 -4.471277 -0.217441
H  7.465721 2.12948 -0.360403
H  6.890567 0.786641 0.610339
H  8.129674 2.306706 2.095267
H  6.861624 4.047259 3.177938
H  5.517483 3.922939 1.930897
elementType: Cl F O N C H
totalener: -2093.81546550 hartree
nucrepener: 3475.49964786 hartree
electener: -5569.31511336 hartree
oneelecener: -9788.78810267 hartree
twoeener: 4219.47298931 hartree
cpcmener: -0.05088591 hartree
kineticenergy: 2086.81591962 hartree
xcener: -168.848928065900 hartree
chargesum: -0.0000000
charge: -0.052524 -0.158663 -0.161132 -0.162238 -0.285130 -0.268743 -0.465422 -0.462736 -0.425031 -0.416299 -0.060155 -0.104457 0.328898 0.070783 0.009153 0.407763 -0.300714 -0.304229 0.057014 -0.140587 0.345404 -0.152738 0.297672 -0.176553 0.414213 0.043288 -0.189584 -0.111233 0.535704 0.097329 -0.187750 -0.266735 0.108057 0.116260 0.121249 0.107390 0.115699 0.110859 0.141542 0.138018 0.154542 0.117080 0.127760 0.139238 0.137750 0.119187 0.106986 0.135317 0.130105 0.118392
qa: -0.0525 -0.1587 -0.1611 -0.1622 -0.2851 -0.2687 -0.4654 -0.4627 -0.4250 -0.4163 -0.0602 -0.1045 0.3289 0.0708 0.0092 0.4078 -0.3007 -0.3042 0.0570 -0.1406 0.3454 -0.1527 0.2977 -0.1766 0.4142 0.0433 -0.1896 -0.1112 0.5357 0.0973 -0.1877 -0.2667 0.1081 0.1163 0.1212 0.1074 0.1157 0.1109 0.1415 0.1380 0.1545 0.1171 0.1278 0.1392 0.1378 0.1192 0.1070 0.1353 0.1301 0.1184
va: 1.2659 1.1519 1.1502 1.1440 2.1600 2.1598 2.0517 2.0491 2.0781 2.0783 3.1216 3.3609 3.7764 3.6598 3.9741 4.2350 3.9187 3.9320 3.6756 4.1253 4.2137 3.8692 4.2274 4.1075 4.1694 3.9787 3.8587 3.9995 4.4199 3.8347 3.8241 3.9331 1.0036 1.0041 1.0129 1.0090 1.0163 1.0028 1.0298 1.0219 1.0028 1.0123 1.0067 0.9876 1.0117 0.9977 1.0131 1.0015 1.0031 1.0061
dispcorr: -0.027140328 hartree
energy: -2093.842605832135
dipole: 44.22120 -46.13865 -1.91745 26.69423 -24.60269 2.09153 10.81324 -10.21667 0.59656
magnitude: 2.89948 au
magnitude: 7.36990 debye
