program: Orca
programVersion: 5.0.2
elementType: Cl F F F O O O O O O N N C C C C C C C C C C C C C C C C C C C C H H H H H H H H H H H H H H H H H H
charge: 0
multiplicity: 1
keywords: wb97x-d3
keywords: def2-TZVPP
keywords: def2/J RIJCOSX
keywords: DEFGRID2
keywords: scfconv7
keywords: smallprint printgap noloewdin
keywords: NOSOSCF
formula: C20H18ClF3N2O6
InChI: InChI=1/C20H18ClF3N2O6/c1-5-8-31-17(29)19(2,3)32-16(28)12-9-11(6-7-13(12)21)26-15(27)10-14(20(22,23)24)25(4)18(26)30/h5-7,9-10H,1,8H2,2-4H3
50 atoms
Cl 3.461362 -3.668375 0.125041
F  -5.601724 1.887789 0.588874
F  -5.327877 2.142253 -1.515342
F  -6.431359 0.451268 -0.794274
O  3.396049 0.028144 -0.728873
O  2.793657 2.219329 0.582219
O  -2.376606 -1.689782 1.703005
O  -1.127108 -0.116869 -2.356656
O  4.920286 2.510834 1.210811
O  3.626568 -0.57037 1.418248
N  -1.759437 -0.93101 -0.335009
N  -3.8696 -0.409528 0.569546
C  4.419334 1.044575 -0.646421
C  -0.509872 -1.610599 -0.206943
C  -4.089964 0.427875 -0.494561
C  -2.651466 -1.047404 0.715835
C  4.302333 1.82768 -1.949667
C  5.803284 0.434767 -0.513394
C  1.865012 -1.495765 0.108238
C  0.634168 -0.865206 0.006567
C  -1.960626 -0.161019 -1.476765
C  -3.204156 0.566527 -1.492286
C  4.092638 1.990904 0.511634
C  -0.438094 -2.987982 -0.333093
C  3.070122 -0.652391 0.356214
C  1.930822 -2.877423 0.005512
C  -4.834423 -0.640264 1.64912
C  0.786544 -3.626134 -0.220358
C  -5.376402 1.232281 -0.549375
C  2.291873 3.065751 1.612767
C  0.829272 3.271587 1.415446
C  0.103274 2.919421 0.361406
H  4.554226 1.185722 -2.794756
H  3.298594 2.221937 -2.104138
H  5.001064 2.664531 -1.945241
H  6.561916 1.208369 -0.627064
H  5.968129 -0.060173 0.441061
H  5.956881 -0.291531 -1.311733
H  0.56732 0.210296 0.108332
H  -3.379249 1.221121 -2.330744
H  -1.328807 -3.57192 -0.524594
H  -4.694977 0.069365 2.462683
H  -5.851146 -0.588944 1.278195
H  -4.69312 -1.644851 2.034111
H  0.846007 -4.701326 -0.31744
H  2.808145 4.030912 1.604601
H  2.478975 2.609743 2.589948
H  0.350272 3.778245 2.247289
H  -0.957932 3.127343 0.335289
H  0.514557 2.423727 -0.50843
elementType: Cl F O N C H
totalener: -2093.81440710 hartree
nucrepener: 3600.81093151 hartree
electener: -5694.62533861 hartree
twoeener: 4343.79198562 hartree
cpcmener: -0.04714061 hartree
kineticenergy: 2086.79700142 hartree
xcener: -168.841857052399 hartree
chargesum: 0.0000000
charge: -0.059077 -0.161790 -0.158937 -0.161414 -0.266722 -0.260548 -0.465474 -0.459122 -0.422588 -0.403841 -0.051506 -0.100409 0.316494 0.082253 0.015323 0.408026 -0.293471 -0.305093 0.081880 -0.129886 0.336150 -0.163021 0.325496 -0.177241 0.340808 0.082526 -0.187027 -0.133416 0.537408 0.088958 -0.169799 -0.290393 0.112811 0.116370 0.109388 0.108790 0.112975 0.111936 0.104499 0.136881 0.153060 0.139117 0.126195 0.116223 0.142073 0.114899 0.118767 0.135025 0.130475 0.115969
qa: -0.0591 -0.1618 -0.1589 -0.1614 -0.2667 -0.2605 -0.4655 -0.4591 -0.4226 -0.4038 -0.0515 -0.1004 0.3165 0.0823 0.0153 0.4080 -0.2935 -0.3051 0.0819 -0.1299 0.3361 -0.1630 0.3255 -0.1772 0.3408 0.0825 -0.1870 -0.1334 0.5374 0.0890 -0.1698 -0.2904 0.1128 0.1164 0.1094 0.1088 0.1130 0.1119 0.1045 0.1369 0.1531 0.1391 0.1262 0.1162 0.1421 0.1149 0.1188 0.1350 0.1305 0.1160
va: 1.2673 1.1494 1.1515 1.1446 2.1665 2.1427 2.0519 2.0489 2.0960 2.0926 3.1245 3.3542 3.7848 3.6992 3.9647 4.2320 3.9338 3.9372 3.6644 4.1083 4.2078 3.8703 4.2010 4.0691 4.2257 3.9046 3.8642 4.0125 4.4194 3.8417 3.8458 3.9392 1.0030 1.0077 1.0055 1.0088 1.0169 1.0047 1.0410 1.0234 1.0038 0.9879 1.0085 1.0082 1.0076 0.9994 0.9949 1.0030 1.0052 1.0134
dispcorr: -0.029937062 hartree
energy: -2093.844344161957
dipole: 28.55089 -31.53060 -2.97970 13.88134 -13.30155 0.57979 2.29031 -2.94965 -0.65935
magnitude: 3.10637 au
magnitude: 7.89577 debye
