program: Orca
programVersion: 5.0.2
elementType: Cl F F F O O O O O O N N C C C C C C C C C C C C C C C C C C C C H H H H H H H H H H H H H H H H H H
charge: 0
multiplicity: 1
keywords: wb97x-d3
keywords: def2-TZVPP
keywords: def2/J RIJCOSX
keywords: DEFGRID2
keywords: scfconv7
keywords: smallprint printgap noloewdin
keywords: NOSOSCF
formula: C20H18ClF3N2O6
InChI: InChI=1/C20H18ClF3N2O6/c1-5-8-31-17(29)19(2,3)32-16(28)12-9-11(6-7-13(12)21)26-15(27)10-14(20(22,23)24)25(4)18(26)30/h5-7,9-10H,1,8H2,2-4H3
50 atoms
Cl 3.391893 -3.573923 0.474634
F  -5.368239 2.44358 -0.69715
F  -5.926726 0.968231 -2.143187
F  -6.378317 0.638445 -0.074814
O  3.151732 0.300219 -1.01693
O  2.927632 2.141055 0.803018
O  -1.865128 -0.368988 1.821284
O  -1.676266 -1.318226 -2.595821
O  5.129904 2.531011 0.826207
O  3.933828 -0.588976 0.883714
N  -1.764049 -0.814225 -0.388325
N  -3.552083 0.417478 0.514901
C  4.152959 1.339746 -1.037287
C  -0.515856 -1.475437 -0.177501
C  -4.123468 0.440565 -0.733599
C  -2.366397 -0.260547 0.725146
C  3.688198 2.3160 -2.111025
C  5.522761 0.778579 -1.376011
C  1.879853 -1.371193 -0.022738
C  0.656374 -0.747288 -0.242951
C  -2.274638 -0.794723 -1.680117
C  -3.543087 -0.121259 -1.804317
C  4.149572 2.060228 0.313019
C  -0.487904 -2.835771 0.074962
C  3.109681 -0.53538 0.008871
C  1.901193 -2.738554 0.240828
C  -4.171186 1.004239 1.706984
C  0.725126 -3.471378 0.274896
C  -5.462294 1.129282 -0.909981
C  2.757001 2.535523 2.179004
C  1.399152 2.064346 2.580242
C  1.20697 0.968624 3.302614
H  4.370099 3.164286 -2.161801
H  3.688593 1.827851 -3.086154
H  2.685056 2.694134 -1.914104
H  5.462476 0.209268 -2.303851
H  6.228982 1.591789 -1.537291
H  5.925685 0.132199 -0.599362
H  0.616016 0.315464 -0.44349
H  -3.994043 -0.096086 -2.783395
H  -1.407094 -3.405325 0.114258
H  -4.66098 1.941785 1.473896
H  -4.878913 0.314362 2.162467
H  -3.394489 1.228845 2.428358
H  0.752318 -4.53606 0.460935
H  2.853682 3.620145 2.258475
H  3.529479 2.071902 2.795312
H  0.550027 2.64141 2.228611
H  0.213302 0.632672 3.567958
H  2.03584 0.367974 3.659866
elementType: Cl F O N C H
totalener: -2093.81482070 hartree
nucrepener: 3603.07821457 hartree
electener: -5696.89303527 hartree
twoeener: 4346.37553088 hartree
cpcmener: -0.04649224 hartree
kineticenergy: 2086.83260192 hartree
xcener: -168.846230971418 hartree
chargesum: 0.0000000
charge: -0.055715 -0.162231 -0.158494 -0.160936 -0.279397 -0.264508 -0.477006 -0.464205 -0.428244 -0.408607 -0.051075 -0.101577 0.318184 0.073477 0.006024 0.418093 -0.292482 -0.306380 0.125264 -0.189277 0.351638 -0.154687 0.335585 -0.177341 0.356523 0.055975 -0.195672 -0.112524 0.536830 0.066500 -0.211287 -0.234343 0.112529 0.111858 0.115864 0.111424 0.107552 0.113804 0.134524 0.138591 0.149177 0.131319 0.139404 0.117949 0.139608 0.119555 0.106417 0.142740 0.128524 0.121059
qa: -0.0557 -0.1622 -0.1585 -0.1609 -0.2794 -0.2645 -0.4770 -0.4642 -0.4282 -0.4086 -0.0511 -0.1016 0.3182 0.0735 0.0060 0.4181 -0.2925 -0.3064 0.1253 -0.1893 0.3516 -0.1547 0.3356 -0.1773 0.3565 0.0560 -0.1957 -0.1125 0.5368 0.0665 -0.2113 -0.2343 0.1125 0.1119 0.1159 0.1114 0.1076 0.1138 0.1345 0.1386 0.1492 0.1313 0.1394 0.1179 0.1396 0.1196 0.1064 0.1427 0.1285 0.1211
va: 1.2658 1.1449 1.1521 1.1495 2.1661 2.1271 2.0314 2.0463 2.0893 2.0766 3.0925 3.3627 3.7655 3.6164 3.9774 4.2125 3.9248 3.9420 3.5685 4.1336 4.2136 3.8737 4.2112 4.1252 4.2328 3.9640 3.8612 3.9914 4.4164 3.8358 3.8401 3.9110 1.0050 1.0038 1.0089 1.0047 1.0091 1.0166 1.0351 1.0219 1.0051 1.0057 0.9879 1.0107 1.0101 0.9957 1.0046 0.9991 1.0111 1.0113
dispcorr: -0.029845656 hartree
energy: -2093.844666351760
dipole: 30.86407 -34.06075 -3.19668 14.72391 -13.70771 1.01620 8.08977 -8.23228 -0.14251
magnitude: 3.35734 au
magnitude: 8.53368 debye
