program: Orca
programVersion: 5.0.2
elementType: Cl F F F O O O O O O N N C C C C C C C C C C C C C C C C C C C C H H H H H H H H H H H H H H H H H H
charge: 0
multiplicity: 1
keywords: wb97x-d3
keywords: def2-TZVPP
keywords: def2/J RIJCOSX
keywords: DEFGRID2
keywords: scfconv7
keywords: smallprint printgap noloewdin
keywords: NOSOSCF
formula: C20H18ClF3N2O6
InChI: InChI=1/C20H18ClF3N2O6/c1-5-8-31-17(29)19(2,3)32-16(28)12-9-11(6-7-13(12)21)26-15(27)10-14(20(22,23)24)25(4)18(26)30/h5-7,9-10H,1,8H2,2-4H3
50 atoms
Cl 3.209814 -2.287497 -1.594921
F  -6.701559 1.421259 -0.050666
F  -7.202073 -0.662854 -0.074088
F  -6.615844 0.298544 1.768184
O  2.278546 1.149496 0.558049
O  4.622369 1.376587 -0.628959
O  -2.518776 -2.475977 1.08002
O  -2.153429 1.067589 -1.704937
O  5.662333 1.696709 1.327795
O  3.404424 -0.736547 0.977813
N  -2.352698 -0.72708 -0.33547
N  -4.388543 -1.230474 0.729809
C  3.269093 1.966083 1.214042
C  -1.003215 -1.104803 -0.611839
C  -4.927219 -0.101594 0.164787
C  -3.055339 -1.539335 0.534432
C  3.20501 1.802084 2.722462
C  2.926536 3.395526 0.81022
C  1.354577 -0.830278 -0.23009
C  0.037607 -0.465437 0.033063
C  -2.850472 0.408851 -0.962933
C  -4.225237 0.7059 -0.644563
C  4.660359 1.638704 0.665532
C  -0.750551 -2.09541 -1.545435
C  2.461716 -0.160195 0.5028
C  1.601329 -1.832247 -1.167266
C  -5.127119 -2.126426 1.624483
C  0.554348 -2.456749 -1.826828
C  -6.374896 0.239767 0.458403
C  5.857045 1.067643 -1.297752
C  6.644653 2.299859 -1.591767
C  7.912447 2.457897 -1.237694
H  3.837126 2.545702 3.205587
H  2.183128 1.971899 3.062693
H  3.523671 0.818945 3.06271
H  1.948584 3.671916 1.205844
H  3.661606 4.085877 1.22304
H  2.909811 3.520574 -0.272312
H  -0.17748 0.307053 0.75984
H  -4.653877 1.589551 -1.089634
H  -1.566625 -2.584176 -2.061218
H  -4.656514 -3.102182 1.605594
H  -5.118016 -1.756534 2.64784
H  -6.146917 -2.264292 1.285461
H  0.755315 -3.220918 -2.564757
H  5.542885 0.584007 -2.223119
H  6.436152 0.345438 -0.719128
H  6.135147 3.073167 -2.158929
H  8.46905 3.344227 -1.514355
H  8.448778 1.700776 -0.677271
elementType: Cl F O N C H
totalener: -2093.81590861 hartree
nucrepener: 3483.03803703 hartree
electener: -5576.85394564 hartree
oneelecener: -9803.52748137 hartree
twoeener: 4226.67353574 hartree
cpcmener: -0.04871452 hartree
kineticenergy: 2086.82485081 hartree
xcener: -168.846435790762 hartree
chargesum: 0.0000000
charge: -0.058134 -0.158428 -0.161999 -0.161272 -0.285642 -0.272533 -0.467388 -0.462498 -0.426040 -0.409819 -0.057660 -0.101749 0.318992 0.060469 0.008310 0.408994 -0.314063 -0.291316 0.069664 -0.143911 0.349091 -0.156706 0.331965 -0.166990 0.404839 0.043096 -0.195463 -0.114642 0.536545 0.072742 -0.194768 -0.245119 0.109212 0.112821 0.114531 0.111601 0.108970 0.114396 0.140481 0.137986 0.151367 0.117109 0.139733 0.131497 0.140639 0.113605 0.108925 0.139394 0.130491 0.118674
qa: -0.0581 -0.1584 -0.1620 -0.1613 -0.2856 -0.2725 -0.4674 -0.4625 -0.4260 -0.4098 -0.0577 -0.1017 0.3190 0.0605 0.0083 0.4090 -0.3141 -0.2913 0.0697 -0.1439 0.3491 -0.1567 0.3320 -0.1670 0.4048 0.0431 -0.1955 -0.1146 0.5365 0.0727 -0.1948 -0.2451 0.1092 0.1128 0.1145 0.1116 0.1090 0.1144 0.1405 0.1380 0.1514 0.1171 0.1397 0.1315 0.1406 0.1136 0.1089 0.1394 0.1305 0.1187
va: 1.2614 1.1521 1.1447 1.1496 2.1554 2.1469 2.0480 2.0492 2.0941 2.0904 3.1073 3.3595 3.7684 3.6461 3.9754 4.2374 3.9417 3.9176 3.6608 4.1320 4.2173 3.8708 4.2356 4.1080 4.1616 3.9704 3.8562 4.0028 4.4161 3.8429 3.8334 3.9475 1.0093 1.0032 1.0144 1.0031 1.0061 1.0143 1.0279 1.0220 1.0040 1.0135 0.9876 1.0053 1.0101 0.9972 1.0094 1.0024 1.0019 1.0076
dispcorr: -0.027322574 hartree
energy: -2093.843231179126
dipole: 44.73511 -47.73323 -2.99812 15.86920 -15.57780 0.29140 5.61112 -5.91236 -0.30124
magnitude: 3.02727 au
magnitude: 7.69472 debye
