program: Orca
programVersion: 5.0.2
elementType: Cl F F F O O O O O O N N C C C C C C C C C C C C C C C C C C C C H H H H H H H H H H H H H H H H H H
charge: 0
multiplicity: 1
keywords: wb97x-d3
keywords: def2-TZVPP
keywords: def2/J RIJCOSX
keywords: DEFGRID2
keywords: scfconv7
keywords: smallprint printgap noloewdin
keywords: NOSOSCF
formula: C20H18ClF3N2O6
InChI: InChI=1/C20H18ClF3N2O6/c1-5-8-31-17(29)19(2,3)32-16(28)12-9-11(6-7-13(12)21)26-15(27)10-14(20(22,23)24)25(4)18(26)30/h5-7,9-10H,1,8H2,2-4H3
50 atoms
Cl 3.389865 -3.539454 -1.427769
F  -5.60953 2.069255 -0.179898
F  -6.557045 0.171145 0.106373
F  -5.594308 1.167078 1.7637
O  2.927764 -0.222262 1.107617
O  2.651622 2.029194 -0.177116
O  -2.285976 -2.497765 1.231664
O  -1.36144 0.570037 -1.967682
O  4.800813 2.583348 0.126034
O  3.944168 -0.582768 -0.85443
N  -1.839028 -0.985729 -0.386592
N  -3.875383 -0.936877 0.789608
C  3.83285 0.836222 1.47768
C  -0.579425 -1.616448 -0.61682
C  -4.197197 0.219035 0.124128
C  -2.645764 -1.536025 0.592163
C  5.226154 0.309744 1.773146
C  3.215424 1.460676 2.724763
C  1.817277 -1.556522 -0.437896
C  0.572029 -1.000199 -0.166736
C  -2.133966 0.151778 -1.131284
C  -3.395289 0.76578 -0.801666
C  3.843036 1.903677 0.381424
C  -0.511933 -2.811181 -1.311717
C  3.026415 -0.761749 -0.097703
C  1.878242 -2.766718 -1.125056
C  -4.727591 -1.564414 1.80382
C  0.719444 -3.398823 -1.546982
C  -5.503164 0.910608 0.45829
C  2.460747 3.046842 -1.176439
C  2.27191 4.386656 -0.549205
C  3.004387 5.448245 -0.856276
H  5.83687 1.099106 2.209063
H  5.162819 -0.494837 2.506112
H  5.740391 -0.065002 0.891347
H  3.806391 2.318587 3.044006
H  2.192938 1.795501 2.549876
H  3.208109 0.737433 3.54087
H  0.500976 -0.064988 0.372705
H  -3.652309 1.673749 -1.323614
H  -1.41294 -3.290151 -1.67177
H  -5.77614 -1.445122 1.562395
H  -4.529756 -2.629989 1.815412
H  -4.524576 -1.159958 2.793535
H  0.774051 -4.34291 -2.070983
H  1.556104 2.735129 -1.699699
H  3.285251 3.043484 -1.891314
H  1.463559 4.470276 0.171103
H  2.816636 6.413022 -0.402671
H  3.822539 5.393459 -1.565115
elementType: Cl F O N C H
totalener: -2093.81501274 hartree
nucrepener: 3549.79352386 hartree
electener: -5643.60853660 hartree
oneelecener: -9936.73005094 hartree
twoeener: 4293.12151435 hartree
cpcmener: -0.04724203 hartree
kineticenergy: 2086.83586644 hartree
xcener: -168.848134014101 hartree
chargesum: 0.0000000
charge: -0.056333 -0.157898 -0.162104 -0.161154 -0.288173 -0.273708 -0.467556 -0.465992 -0.423685 -0.409985 -0.060166 -0.102718 0.323258 0.083650 0.005468 0.410119 -0.304828 -0.295606 0.100904 -0.167914 0.352864 -0.157963 0.331471 -0.179450 0.378088 0.033026 -0.192382 -0.106102 0.537903 0.070645 -0.193713 -0.243953 0.106343 0.111501 0.113058 0.113831 0.114766 0.112418 0.137315 0.138672 0.153997 0.129386 0.116480 0.140214 0.139956 0.114462 0.112043 0.139191 0.131002 0.119351
qa: -0.0563 -0.1579 -0.1621 -0.1612 -0.2882 -0.2737 -0.4676 -0.4660 -0.4237 -0.4100 -0.0602 -0.1027 0.3233 0.0836 0.0055 0.4101 -0.3048 -0.2956 0.1009 -0.1679 0.3529 -0.1580 0.3315 -0.1795 0.3781 0.0330 -0.1924 -0.1061 0.5379 0.0706 -0.1937 -0.2440 0.1063 0.1115 0.1131 0.1138 0.1148 0.1124 0.1373 0.1387 0.1540 0.1294 0.1165 0.1402 0.1400 0.1145 0.1120 0.1392 0.1310 0.1194
va: 1.2641 1.1528 1.1453 1.1495 2.1609 2.1316 2.0489 2.0381 2.0955 2.0847 3.1228 3.3624 3.7545 3.6604 3.9821 4.2343 3.9388 3.9223 3.6142 4.1320 4.1963 3.8731 4.2205 4.1067 4.2237 3.9789 3.8610 3.9861 4.4165 3.8373 3.8213 3.9497 1.0097 1.0044 1.0177 1.0063 1.0087 1.0039 1.0352 1.0219 1.0032 1.0079 1.0100 0.9875 1.0091 0.9985 1.0106 1.0027 1.0016 1.0080
dispcorr: -0.027802264 hartree
energy: -2093.842815002514
dipole: 31.26313 -34.79462 -3.53149 17.12561 -17.00232 0.12330 10.94746 -9.39433 1.55313
magnitude: 3.85990 au
magnitude: 9.81109 debye
