program: Orca
programVersion: 5.0.2
elementType: Cl F F F O O O O O O N N C C C C C C C C C C C C C C C C C C C C H H H H H H H H H H H H H H H H H H
charge: 0
multiplicity: 1
keywords: wb97x-d3
keywords: def2-TZVPP
keywords: def2/J RIJCOSX
keywords: DEFGRID2
keywords: scfconv7
keywords: smallprint printgap noloewdin
keywords: NOSOSCF
formula: C20H18ClF3N2O6
InChI: InChI=1/C20H18ClF3N2O6/c1-5-8-31-17(29)19(2,3)32-16(28)12-9-11(6-7-13(12)21)26-15(27)10-14(20(22,23)24)25(4)18(26)30/h5-7,9-10H,1,8H2,2-4H3
50 atoms
Cl 3.085457 -2.563887 -1.493333
F  -6.588674 0.91558 1.50431
F  -6.798915 1.38852 -0.575327
F  -7.217211 -0.600884 0.095369
O  2.239148 1.262006 0.006718
O  5.543994 2.037951 0.851597
O  -2.477962 -1.935955 1.48778
O  -2.288572 0.658911 -2.214051
O  4.732199 1.444099 -1.147217
O  3.40504 -0.518948 0.69219
N  -2.40346 -0.674437 -0.383796
N  -4.377754 -0.85041 0.880467
C  3.199663 2.187559 0.550854
C  -1.070092 -1.12686 -0.620031
C  -4.960804 0.057917 0.033106
C  -3.051039 -1.19977 0.717668
C  3.113457 2.221962 2.06868
C  2.816258 3.538198 -0.041671
C  1.303226 -0.823551 -0.388419
C  0.001405 -0.389078 -0.157403
C  -2.943088 0.236781 -1.284187
C  -4.30833 0.604593 -1.003684
C  4.574477 1.815892 -0.013393
C  -0.866483 -2.288907 -1.34271
C  2.438228 -0.037059 0.163591
C  1.501255 -1.998609 -1.112072
C  -5.040517 -1.446848 2.044707
C  0.422317 -2.722305 -1.595024
C  -6.4046 0.444821 0.270358
C  6.893366 1.73966 0.445105
C  7.151479 0.270792 0.491813
C  7.57306 -0.433223 -0.549467
H  3.668942 3.073161 2.458211
H  2.072459 2.353343 2.364312
H  3.494747 1.322796 2.546909
H  1.838866 3.848626 0.328656
H  3.541503 4.296285 0.252486
H  2.781219 3.503171 -1.130315
H  -0.177624 0.51948 0.402321
H  -4.773145 1.318023 -1.665338
H  -1.70837 -2.856516 -1.71696
H  -4.846438 -0.865142 2.944466
H  -6.107673 -1.537303 1.891678
H  -4.662217 -2.452881 2.187612
H  0.585123 -3.621903 -2.171729
H  7.511566 2.263781 1.174094
H  7.100857 2.159024 -0.540709
H  6.999725 -0.213501 1.451635
H  7.783581 -1.491427 -0.463481
H  7.733742 0.018431 -1.521322
elementType: Cl F O N C H
totalener: -2093.81557055 hartree
nucrepener: 3479.20881083 hartree
electener: -5573.02438138 hartree
oneelecener: -9796.80491957 hartree
twoeener: 4223.78053818 hartree
cpcmener: -0.05180010 hartree
kineticenergy: 2086.83601885 hartree
xcener: -168.847875857420 hartree
chargesum: 0.0000000
charge: -0.054774 -0.161311 -0.157685 -0.162702 -0.281850 -0.265548 -0.469450 -0.464143 -0.431977 -0.416632 -0.051398 -0.105888 0.318199 0.046192 0.002761 0.415006 -0.307813 -0.290211 0.073973 -0.138356 0.349696 -0.154934 0.320498 -0.166265 0.401498 0.053923 -0.184079 -0.116639 0.536488 0.069179 -0.194047 -0.242838 0.108779 0.111225 0.115016 0.111151 0.108425 0.115717 0.138041 0.138306 0.150757 0.138740 0.124155 0.116280 0.138891 0.116747 0.108526 0.140994 0.130616 0.118761
qa: -0.0548 -0.1613 -0.1577 -0.1627 -0.2819 -0.2655 -0.4694 -0.4641 -0.4320 -0.4166 -0.0514 -0.1059 0.3182 0.0462 0.0028 0.4150 -0.3078 -0.2902 0.0740 -0.1384 0.3497 -0.1549 0.3205 -0.1663 0.4015 0.0539 -0.1841 -0.1166 0.5365 0.0692 -0.1940 -0.2428 0.1088 0.1112 0.1150 0.1112 0.1084 0.1157 0.1380 0.1383 0.1508 0.1387 0.1242 0.1163 0.1389 0.1167 0.1085 0.1410 0.1306 0.1188
va: 1.2654 1.1505 1.1536 1.1444 2.1649 2.1660 2.0461 2.0468 2.0802 2.0799 3.0977 3.3726 3.7731 3.6378 3.9757 4.2308 3.9378 3.9244 3.6679 4.1454 4.2163 3.8710 4.2451 4.1109 4.1682 3.9707 3.8691 4.0035 4.4221 3.8484 3.8078 3.9448 1.0079 1.0026 1.0158 1.0025 1.0059 1.0151 1.0295 1.0222 1.0047 0.9877 1.0115 1.0070 1.0112 0.9957 1.0088 1.0017 1.0016 1.0079
dispcorr: -0.027133339 hartree
energy: -2093.842703890959
dipole: 46.35125 -48.48287 -2.13162 13.17323 -12.29819 0.87504 10.35103 -8.71766 1.63336
magnitude: 2.82442 au
magnitude: 7.17912 debye
