program: Orca
programVersion: 5.0.2
elementType: Cl F F F O O O O O O N N C C C C C C C C C C C C C C C C C C C C H H H H H H H H H H H H H H H H H H
charge: 0
multiplicity: 1
keywords: wb97x-d3
keywords: def2-TZVPP
keywords: def2/J RIJCOSX
keywords: DEFGRID2
keywords: scfconv7
keywords: smallprint printgap noloewdin
keywords: NOSOSCF
formula: C20H18ClF3N2O6
InChI: InChI=1/C20H18ClF3N2O6/c1-5-8-31-17(29)19(2,3)32-16(28)12-9-11(6-7-13(12)21)26-15(27)10-14(20(22,23)24)25(4)18(26)30/h5-7,9-10H,1,8H2,2-4H3
50 atoms
Cl 3.244381 -3.380181 -1.29928
F  -6.168832 0.896861 1.516967
F  -6.147304 1.691222 -0.470947
F  -6.830378 -0.312496 -0.147494
O  2.657596 0.147523 1.130726
O  3.351847 2.216618 -0.384646
O  -2.350782 -2.325486 1.388845
O  -1.651743 0.629481 -1.966279
O  5.445367 2.163882 0.404844
O  3.923148 -0.633507 -0.533672
N  -2.02101 -0.878882 -0.313457
N  -4.087728 -0.978949 0.807047
C  3.712389 1.003062 1.611068
C  -0.735031 -1.459473 -0.535841
C  -4.516727 0.078432 0.043137
C  -2.794002 -1.449884 0.681194
C  4.78862 0.188879 2.309219
C  3.035513 1.956321 2.590333
C  1.663906 -1.364165 -0.336272
C  0.403755 -0.821293 -0.086548
C  -2.404937 0.18051 -1.12838
C  -3.741547 0.662974 -0.882867
C  4.289879 1.836003 0.464428
C  -0.644544 -2.65531 -1.22728
C  2.877165 -0.601788 0.060803
C  1.743109 -2.581624 -1.016104
C  -4.89715 -1.616523 1.850513
C  0.594547 -3.224253 -1.452129
C  -5.928759 0.592716 0.241539
C  3.740876 3.029905 -1.505368
C  3.932164 4.45645 -1.112125
C  5.036329 5.143308 -1.370595
H  5.492909 0.850698 2.810668
H  4.330127 -0.438816 3.073531
H  5.351364 -0.448504 1.630341
H  2.219697 2.50946 2.124474
H  2.63687 1.399806 3.439134
H  3.76012 2.67453 2.973128
H  0.311445 0.115962 0.445461
H  -4.085069 1.491392 -1.482252
H  -1.536639 -3.14922 -1.589425
H  -5.938142 -1.683911 1.554174
H  -4.545778 -2.632798 1.990856
H  -4.810035 -1.083198 2.796727
H  0.666222 -4.168586 -1.973397
H  2.907878 2.935016 -2.202496
H  4.63101 2.619045 -1.985389
H  3.089899 4.93908 -0.625212
H  5.122828 6.191085 -1.112635
H  5.89242 4.688527 -1.855805
elementType: Cl F O N C H
totalener: -2093.81567431 hartree
nucrepener: 3498.41031426 hartree
electener: -5592.22598857 hartree
oneelecener: -9834.21970432 hartree
twoeener: 4241.99371575 hartree
cpcmener: -0.04773705 hartree
kineticenergy: 2086.80482321 hartree
xcener: -168.844043328953 hartree
chargesum: -0.0000000
charge: -0.051958 -0.160928 -0.158318 -0.162102 -0.287691 -0.277387 -0.467299 -0.462699 -0.427401 -0.416660 -0.057948 -0.102278 0.313482 0.071947 0.007021 0.408583 -0.311975 -0.296179 0.054730 -0.164633 0.346355 -0.153949 0.342473 -0.172138 0.425457 0.050391 -0.189728 -0.109002 0.535454 0.073331 -0.194128 -0.244930 0.107073 0.111896 0.113105 0.114158 0.111707 0.113935 0.141253 0.138232 0.153716 0.128705 0.116559 0.139203 0.137825 0.117192 0.107587 0.138953 0.130425 0.118583
qa: -0.0520 -0.1609 -0.1583 -0.1621 -0.2877 -0.2774 -0.4673 -0.4627 -0.4274 -0.4167 -0.0579 -0.1023 0.3135 0.0719 0.0070 0.4086 -0.3120 -0.2962 0.0547 -0.1646 0.3464 -0.1539 0.3425 -0.1721 0.4255 0.0504 -0.1897 -0.1090 0.5355 0.0733 -0.1941 -0.2449 0.1071 0.1119 0.1131 0.1142 0.1117 0.1139 0.1413 0.1382 0.1537 0.1287 0.1166 0.1392 0.1378 0.1172 0.1076 0.1390 0.1304 0.1186
va: 1.2663 1.1502 1.1527 1.1445 2.1638 2.1399 2.0483 2.0491 2.0932 2.0738 3.1135 3.3621 3.7677 3.6528 3.9748 4.2362 3.9422 3.9177 3.6597 4.1610 4.2161 3.8688 4.2142 4.1076 4.1694 3.9719 3.8582 3.9962 4.4201 3.8469 3.8209 3.9473 1.0093 1.0044 1.0166 1.0111 1.0040 1.0060 1.0312 1.0219 1.0029 1.0065 1.0122 0.9876 1.0120 0.9948 1.0101 1.0024 1.0018 1.0077
dispcorr: -0.026842597 hartree
energy: -2093.842516906223
dipole: 37.56563 -41.11588 -3.55025 18.49810 -18.24241 0.25570 10.87591 -9.69336 1.18255
magnitude: 3.75074 au
magnitude: 9.53363 debye
