program: Orca
programVersion: 5.0.2
elementType: Cl F F F O O O O O O N N C C C C C C C C C C C C C C C C C C C C H H H H H H H H H H H H H H H H H H
charge: 0
multiplicity: 1
keywords: wb97x-d3
keywords: def2-TZVPP
keywords: def2/J RIJCOSX
keywords: DEFGRID2
keywords: scfconv7
keywords: smallprint printgap noloewdin
keywords: NOSOSCF
formula: C20H18ClF3N2O6
InChI: InChI=1/C20H18ClF3N2O6/c1-5-8-31-17(29)19(2,3)32-16(28)12-9-11(6-7-13(12)21)26-15(27)10-14(20(22,23)24)25(4)18(26)30/h5-7,9-10H,1,8H2,2-4H3
50 atoms
Cl 3.262182 -3.118845 -0.52616
F  -6.500067 1.205213 -1.226257
F  -7.122765 -0.538583 -0.1537
F  -6.368993 1.180089 0.912145
O  3.5313 -0.216577 -0.195264
O  4.73108 2.733199 1.269383
O  -2.679145 -2.318322 1.430619
O  -1.860895 0.210361 -2.227355
O  3.27721 2.508268 -0.416029
O  2.261181 0.440074 1.522448
N  -2.269258 -1.031363 -0.376504
N  -4.371295 -0.996769 0.678315
C  4.634079 0.619681 0.202223
C  -0.930518 -1.526876 -0.407737
C  -4.799792 -0.107403 -0.276126
C  -3.085901 -1.504448 0.633334
C  5.592678 0.586677 -0.982691
C  5.307796 0.068619 1.448885
C  1.412989 -1.184147 0.024374
C  0.093605 -0.744955 0.087266
C  -2.645195 -0.134378 -1.369246
C  -4.007965 0.324415 -1.268815
C  4.109046 2.05312 0.323125
C  -0.663772 -2.772236 -0.949534
C  2.443507 -0.247159 0.549191
C  1.671957 -2.448366 -0.503726
C  -5.238964 -1.532932 1.731306
C  0.637503 -3.239554 -0.980784
C  -6.21266 0.434775 -0.184344
C  4.398721 4.111095 1.438577
C  5.11142 5.016761 0.492162
C  6.039078 4.677111 -0.391656
H  5.11228 0.926452 -1.90026
H  6.451456 1.228343 -0.787684
H  5.961612 -0.427708 -1.137307
H  4.696813 0.149354 2.345362
H  5.547785 -0.983022 1.289409
H  6.246356 0.58956 1.632592
H  -0.127713 0.226807 0.509884
H  -4.346003 1.028083 -2.012622
H  -1.464893 -3.385344 -1.340902
H  -5.859714 -0.756523 2.163303
H  -5.858739 -2.343237 1.352374
H  -4.618222 -1.919649 2.530198
H  0.846102 -4.222932 -1.378725
H  4.684908 4.349925 2.464626
H  3.318206 4.258924 1.369755
H  4.816531 6.057254 0.588648
H  6.496326 5.428695 -1.021808
H  6.384775 3.660303 -0.533224
elementType: Cl F O N C H
totalener: -2093.81539050 hartree
nucrepener: 3465.53341438 hartree
electener: -5559.34880488 hartree
oneelecener: -9769.18645754 hartree
twoeener: 4209.83765266 hartree
cpcmener: -0.04891994 hartree
kineticenergy: 2086.81800754 hartree
xcener: -168.848568471296 hartree
chargesum: 0.0000000
charge: -0.059427 -0.158477 -0.161467 -0.162381 -0.276636 -0.266548 -0.467805 -0.461770 -0.426192 -0.435353 -0.057020 -0.101907 0.324812 0.058240 0.009050 0.405603 -0.293440 -0.299860 0.052793 -0.136091 0.348856 -0.154337 0.291804 -0.171032 0.437210 0.047299 -0.194406 -0.114101 0.537154 0.095622 -0.188179 -0.266335 0.120828 0.107011 0.114374 0.115909 0.108484 0.108529 0.139711 0.138355 0.153198 0.130149 0.139138 0.118253 0.140064 0.119304 0.106568 0.135092 0.130584 0.118770
qa: -0.0594 -0.1585 -0.1615 -0.1624 -0.2766 -0.2665 -0.4678 -0.4618 -0.4262 -0.4354 -0.0570 -0.1019 0.3248 0.0582 0.0091 0.4056 -0.2934 -0.2999 0.0528 -0.1361 0.3489 -0.1543 0.2918 -0.1710 0.4372 0.0473 -0.1944 -0.1141 0.5372 0.0956 -0.1882 -0.2663 0.1208 0.1070 0.1144 0.1159 0.1085 0.1085 0.1397 0.1384 0.1532 0.1301 0.1391 0.1183 0.1401 0.1193 0.1066 0.1351 0.1306 0.1188
va: 1.2582 1.1520 1.1493 1.1445 2.1771 2.1579 2.0499 2.0496 2.0761 2.0699 3.1081 3.3588 3.7932 3.6591 3.9744 4.2435 3.9186 3.9268 3.6909 4.1392 4.2161 3.8725 4.2300 4.1102 4.1310 3.9625 3.8525 3.9905 4.4170 3.8374 3.8245 3.9335 1.0131 1.0052 1.0058 1.0162 1.0062 1.0095 1.0288 1.0220 1.0037 1.0048 0.9874 1.0160 1.0096 0.9976 1.0127 1.0016 1.0030 1.0061
dispcorr: -0.027501775 hartree
energy: -2093.842892277525
dipole: 50.26990 -50.95430 -0.68440 15.70555 -16.01235 -0.30681 6.90555 -6.14047 0.76508
magnitude: 1.07139 au
magnitude: 2.72325 debye
