program: Orca
programVersion: 5.0.2
elementType: Cl F F F O O O O O O N N C C C C C C C C C C C C C C C C C C C C H H H H H H H H H H H H H H H H H H
charge: 0
multiplicity: 1
keywords: wb97x-d3
keywords: def2-TZVPP
keywords: def2/J RIJCOSX
keywords: DEFGRID2
keywords: scfconv7
keywords: smallprint printgap noloewdin
keywords: NOSOSCF
formula: C20H18ClF3N2O6
InChI: InChI=1/C20H18ClF3N2O6/c1-5-8-31-17(29)19(2,3)32-16(28)12-9-11(6-7-13(12)21)26-15(27)10-14(20(22,23)24)25(4)18(26)30/h5-7,9-10H,1,8H2,2-4H3
50 atoms
Cl 3.342404 -2.909536 0.126731
F  -6.794016 0.012383 -1.675355
F  -6.910327 0.066231 0.461967
F  -6.195387 1.783688 -0.631786
O  2.285174 1.182374 -0.242386
O  4.491559 1.039331 1.176151
O  -2.073348 -0.155476 1.743721
O  -2.383815 -1.868508 -2.429267
O  5.639287 2.230291 -0.333231
O  3.60555 -0.298757 -1.271545
N  -2.222491 -0.973408 -0.353618
N  -4.014949 0.201422 0.614092
C  3.230374 2.254977 -0.410125
C  -0.874271 -1.432307 -0.247733
C  -4.759428 -0.077469 -0.50568
C  -2.732868 -0.299979 0.740031
C  2.703392 3.376039 0.479344
C  3.304968 2.708002 -1.858757
C  1.484511 -0.985956 -0.418698
C  0.162606 -0.557496 -0.504318
C  -2.915038 -1.262187 -1.523417
C  -4.274037 -0.780141 -1.540162
C  4.601047 1.828203 0.118882
C  -0.616964 -2.743727 0.111131
C  2.581448 -0.023041 -0.704278
C  1.736232 -2.311104 -0.062616
C  -4.528827 0.942517 1.770309
C  0.691247 -3.182166 0.206303
C  -6.178305 0.449597 -0.583851
C  5.682879 0.534795 1.775044
C  6.292826 1.468629 2.764186
C  5.812565 2.639439 3.15899
H  2.591764 3.056334 1.5154
H  3.382788 4.226911 0.452245
H  1.731362 3.712502 0.116824
H  3.873264 3.634018 -1.931139
H  3.77076 1.975945 -2.514934
H  2.299448 2.912916 -2.227268
H  -0.060378 0.462889 -0.786986
H  -4.86263 -0.997578 -2.417112
H  -1.430916 -3.423886 0.324843
H  -5.120974 1.794166 1.456728
H  -5.112806 0.298066 2.42425
H  -3.689259 1.332769 2.332446
H  0.898339 -4.202378 0.498121
H  6.413342 0.259161 1.010082
H  5.384294 -0.390097 2.272733
H  7.218522 1.095675 3.191832
H  6.338929 3.224686 3.901608
H  4.888229 3.062416 2.784815
elementType: Cl F O N C H
totalener: -2093.81619879 hartree
nucrepener: 3505.71867109 hartree
electener: -5599.53486988 hartree
oneelecener: -9848.49127002 hartree
twoeener: 4248.95640014 hartree
cpcmener: -0.04922206 hartree
kineticenergy: 2086.82024186 hartree
xcener: -168.849144057875 hartree
chargesum: 0.0000000
charge: -0.055886 -0.158456 -0.161331 -0.162494 -0.288699 -0.271740 -0.467444 -0.463030 -0.420182 -0.412436 -0.055019 -0.103276 0.347778 0.049350 0.007008 0.409135 -0.313912 -0.312566 0.062267 -0.131810 0.350219 -0.154877 0.303156 -0.168204 0.409542 0.043624 -0.195695 -0.109820 0.537367 0.093122 -0.183954 -0.268847 0.115036 0.113223 0.117181 0.110208 0.115404 0.112696 0.139276 0.138402 0.152061 0.132502 0.138991 0.116861 0.138501 0.106647 0.116464 0.133701 0.131006 0.118951
qa: -0.0559 -0.1585 -0.1613 -0.1625 -0.2887 -0.2717 -0.4674 -0.4630 -0.4202 -0.4124 -0.0550 -0.1033 0.3478 0.0494 0.0070 0.4091 -0.3139 -0.3126 0.0623 -0.1318 0.3502 -0.1549 0.3032 -0.1682 0.4095 0.0436 -0.1957 -0.1098 0.5374 0.0931 -0.1840 -0.2688 0.1150 0.1132 0.1172 0.1102 0.1154 0.1127 0.1393 0.1384 0.1521 0.1325 0.1390 0.1169 0.1385 0.1066 0.1165 0.1337 0.1310 0.1190
va: 1.2625 1.1522 1.1494 1.1444 2.1490 2.1382 2.0488 2.0474 2.0913 2.0867 3.1024 3.3597 3.7423 3.6474 3.9770 4.2373 3.9223 3.9399 3.6768 4.1295 4.2142 3.8709 4.2316 4.1167 4.1575 3.9767 3.8546 4.0002 4.4154 3.8372 3.8361 3.9367 1.0109 1.0040 1.0045 1.0087 1.0142 1.0033 1.0305 1.0218 1.0040 1.0045 0.9880 1.0153 1.0113 1.0115 0.9996 1.0020 1.0032 1.0040
dispcorr: -0.027772739 hartree
energy: -2093.843971530706
dipole: 40.73614 -43.70935 -2.97321 22.65489 -21.75810 0.89679 13.23727 -11.47492 1.76235
magnitude: 3.57073 au
magnitude: 9.07607 debye
