program: Orca
programVersion: 5.0.2
elementType: Cl F F F O O O O O O N N C C C C C C C C C C C C C C C C C C C C H H H H H H H H H H H H H H H H H H
charge: 0
multiplicity: 1
keywords: wb97x-d3
keywords: def2-TZVPP
keywords: def2/J RIJCOSX
keywords: DEFGRID2
keywords: scfconv7
keywords: smallprint printgap noloewdin
keywords: NOSOSCF
formula: C20H18ClF3N2O6
InChI: InChI=1/C20H18ClF3N2O6/c1-5-8-31-17(29)19(2,3)32-16(28)12-9-11(6-7-13(12)21)26-15(27)10-14(20(22,23)24)25(4)18(26)30/h5-7,9-10H,1,8H2,2-4H3
50 atoms
Cl 3.481633 -3.563066 -0.85028
F  -5.533609 1.221916 2.283601
F  -5.315674 2.222129 0.404301
F  -6.419231 0.369007 0.53182
O  3.156771 0.05801 1.083843
O  2.665821 2.177126 -0.339879
O  -1.922396 -0.534162 -1.924552
O  -1.561206 -1.553189 2.468479
O  4.830627 2.767214 -0.398003
O  3.892408 -0.475094 -0.964295
N  -1.74814 -1.042747 0.268068
N  -3.622942 0.109135 -0.560786
C  4.082214 1.154035 1.231271
C  -0.486112 -1.656776 0.002981
C  -4.071171 0.243693 0.730042
C  -2.402599 -0.486782 -0.814668
C  5.512389 0.664324 1.380209
C  3.624943 1.878455 2.493245
C  1.90594 -1.4774 -0.122896
C  0.667284 -0.91274 0.159647
C  -2.192544 -1.014551 1.584268
C  -3.420988 -0.284854 1.77768
C  3.926099 2.113348 0.048376
C  -0.422878 -2.979044 -0.399554
C  3.106994 -0.601298 -0.062112
C  1.963963 -2.804738 -0.536746
C  -4.332705 0.632672 -1.731583
C  0.807503 -3.558284 -0.661086
C  -5.347231 1.022348 0.984703
C  2.280773 2.947801 -1.493507
C  1.487518 2.054471 -2.385382
C  0.202867 2.240867 -2.657914
H  5.922466 0.245781 0.464141
H  6.155513 1.485696 1.693284
H  5.555596 -0.097392 2.15907
H  4.244474 2.757877 2.664864
H  2.585246 2.198908 2.426191
H  3.728562 1.22193 3.357851
H  0.599153 0.1207 0.474027
H  -3.777731 -0.180555 2.789888
H  -1.326645 -3.563748 -0.509139
H  -4.042623 0.054866 -2.601432
H  -5.40465 0.516319 -1.621763
H  -4.084187 1.676896 -1.91127
H  0.862789 -4.594803 -0.963678
H  3.164016 3.332414 -2.005275
H  1.690045 3.79482 -1.141205
H  2.023884 1.219997 -2.82709
H  -0.330777 1.582819 -3.330943
H  -0.35926 3.06482 -2.232935
elementType: Cl F O N C H
totalener: -2093.81449959 hartree
nucrepener: 3607.83591347 hartree
electener: -5701.65041306 hartree
twoeener: 4351.00611410 hartree
cpcmener: -0.04644207 hartree
kineticenergy: 2086.82113396 hartree
xcener: -168.844184055807 hartree
chargesum: -0.0000000
charge: -0.057038 -0.158584 -0.161456 -0.161684 -0.277356 -0.263218 -0.472466 -0.462964 -0.426282 -0.408452 -0.047598 -0.097435 0.304375 0.066523 0.009574 0.406953 -0.303293 -0.295142 0.127210 -0.170619 0.351576 -0.160458 0.342953 -0.177970 0.353249 0.048644 -0.195847 -0.112581 0.536479 0.075722 -0.197681 -0.251820 0.112904 0.106860 0.111589 0.111697 0.116377 0.112599 0.134192 0.138037 0.149771 0.117183 0.132445 0.138876 0.140290 0.109526 0.108562 0.144147 0.131435 0.120195
qa: -0.0570 -0.1586 -0.1615 -0.1617 -0.2774 -0.2632 -0.4725 -0.4630 -0.4263 -0.4085 -0.0476 -0.0974 0.3044 0.0665 0.0096 0.4070 -0.3033 -0.2951 0.1272 -0.1706 0.3516 -0.1605 0.3430 -0.1780 0.3532 0.0486 -0.1958 -0.1126 0.5365 0.0757 -0.1977 -0.2518 0.1129 0.1069 0.1116 0.1117 0.1164 0.1126 0.1342 0.1380 0.1498 0.1172 0.1324 0.1389 0.1403 0.1095 0.1086 0.1441 0.1314 0.1202
va: 1.2646 1.1518 1.1490 1.1447 2.1657 2.1289 2.0352 2.0484 2.0987 2.0804 3.0970 3.3597 3.7682 3.6323 3.9741 4.2284 3.9389 3.9284 3.5874 4.1167 4.2133 3.8778 4.2148 4.1227 4.2267 3.9618 3.8578 3.9907 4.4166 3.8184 3.8137 3.9378 1.0171 1.0089 1.0046 1.0058 1.0086 1.0040 1.0392 1.0223 1.0051 1.0125 1.0057 0.9877 1.0092 1.0188 1.0014 1.0054 1.0079 1.0082
dispcorr: -0.029718115 hartree
energy: -2093.844217700693
dipole: 27.67768 -30.94815 -3.27047 15.82006 -14.99153 0.82853 -5.22565 5.51376 0.28812
magnitude: 3.38607 au
magnitude: 8.60670 debye
