program: Orca
programVersion: 5.0.2
elementType: Cl F F F O O O O O O N N C C C C C C C C C C C C C C C C C C C C H H H H H H H H H H H H H H H H H H
charge: 0
multiplicity: 1
keywords: wb97x-d3
keywords: def2-TZVPP
keywords: def2/J RIJCOSX
keywords: DEFGRID2
keywords: scfconv7
keywords: smallprint printgap noloewdin
keywords: NOSOSCF
formula: C20H18ClF3N2O6
InChI: InChI=1/C20H18ClF3N2O6/c1-5-8-31-17(29)19(2,3)32-16(28)12-9-11(6-7-13(12)21)26-15(27)10-14(20(22,23)24)25(4)18(26)30/h5-7,9-10H,1,8H2,2-4H3
50 atoms
Cl 3.336549 -2.289078 0.600115
F  -6.62824 1.380818 -0.20815
F  -6.63978 0.495501 -2.15862
F  -7.186329 -0.685241 -0.460409
O  3.463539 0.196405 -0.947848
O  4.851885 1.158267 1.117181
O  -2.601972 -0.830885 1.842103
O  -1.987331 -0.760096 -2.639676
O  5.240039 3.070084 0.030015
O  2.164023 1.720438 0.044453
N  -2.300792 -0.795908 -0.393505
N  -4.416719 -0.370828 0.546785
C  4.512755 1.144987 -1.222649
C  -0.93114 -1.147688 -0.188256
C  -4.897932 -0.140169 -0.718927
C  -3.081122 -0.672747 0.742736
C  4.111392 2.07604 -2.352993
C  5.716825 0.29855 -1.620893
C  1.391542 -0.512963 -0.131847
C  0.050458 -0.184633 -0.313483
C  -2.73999 -0.615374 -1.700015
C  -4.129339 -0.244409 -1.813141
C  4.88137 1.921547 0.042298
C  -0.59582 -2.450638 0.138827
C  2.375146 0.58989 -0.316669
C  1.718047 -1.81985 0.22952
C  -5.26033 -0.307427 1.743648
C  0.72744 -2.781579 0.364549
C  -6.351513 0.264851 -0.883672
C  5.207527 1.761547 2.375065
C  5.159064 0.69085 3.408356
C  4.392286 0.75667 4.487994
H  3.811889 1.48758 -3.220425
H  3.292633 2.741956 -2.087802
H  4.95969 2.689726 -2.651692
H  6.57695 0.940444 -1.809045
H  5.987495 -0.417299 -0.84526
H  5.502723 -0.250396 -2.538467
H  -0.221129 0.832139 -0.566594
H  -4.508452 -0.059495 -2.805464
H  -1.362138 -3.20891 0.2330
H  -6.110852 -0.975674 1.652502
H  -4.677417 -0.637288 2.593791
H  -5.593244 0.708022 1.940279
H  0.987556 -3.791019 0.651648
H  4.512679 2.571103 2.607779
H  6.214337 2.181243 2.302367
H  5.823587 -0.155367 3.262441
H  4.410419 -0.021422 5.240286
H  3.720935 1.589061 4.664246
elementType: Cl F O N C H
totalener: -2093.81567196 hartree
nucrepener: 3492.12211828 hartree
electener: -5585.93779025 hartree
oneelecener: -9821.92087882 hartree
twoeener: 4235.98308857 hartree
cpcmener: -0.04597364 hartree
kineticenergy: 2086.81175352 hartree
xcener: -168.843852394265 hartree
chargesum: -0.0000000
charge: -0.060507 -0.161993 -0.158648 -0.161747 -0.276747 -0.264949 -0.465154 -0.461183 -0.433360 -0.432265 -0.061046 -0.093354 0.317145 0.058717 0.006970 0.400188 -0.311318 -0.295440 0.045323 -0.121959 0.349811 -0.156417 0.339521 -0.170634 0.439613 0.033719 -0.208753 -0.114048 0.540150 0.083269 -0.218779 -0.241023 0.113159 0.113511 0.107058 0.114224 0.112700 0.111751 0.141316 0.138545 0.153946 0.139550 0.116214 0.140253 0.140147 0.111065 0.110671 0.140722 0.130405 0.119661
qa: -0.0605 -0.1620 -0.1586 -0.1617 -0.2767 -0.2649 -0.4652 -0.4612 -0.4334 -0.4323 -0.0610 -0.0934 0.3171 0.0587 0.0070 0.4002 -0.3113 -0.2954 0.0453 -0.1220 0.3498 -0.1564 0.3395 -0.1706 0.4396 0.0337 -0.2088 -0.1140 0.5402 0.0833 -0.2188 -0.2410 0.1132 0.1135 0.1071 0.1142 0.1127 0.1118 0.1413 0.1385 0.1539 0.1395 0.1162 0.1403 0.1401 0.1111 0.1107 0.1407 0.1304 0.1197
va: 1.2575 1.1460 1.1522 1.1462 2.1724 2.1449 2.0536 2.0515 2.0865 2.0680 3.1137 3.3414 3.8009 3.6832 3.9853 4.2453 3.9442 3.9298 3.6784 4.1048 4.2130 3.8741 4.1968 4.1015 4.1198 3.9694 3.8383 3.9959 4.4078 3.8144 3.8793 3.9469 1.0043 1.0152 1.0102 1.0063 1.0118 1.0037 1.0270 1.0219 1.0028 0.9962 1.0256 0.9922 1.0095 1.0035 0.9975 1.0025 1.0024 1.0087
dispcorr: -0.027394647 hartree
energy: -2093.843066609278
dipole: 46.01750 -47.57934 -1.56184 8.20040 -9.65158 -1.45119 9.98339 -9.36744 0.61595
magnitude: 2.21916 au
magnitude: 5.64067 debye
