program: Orca
programVersion: 5.0.2
elementType: Cl F F F O O O O O O N N C C C C C C C C C C C C C C C C C C C C H H H H H H H H H H H H H H H H H H
charge: 0
multiplicity: 1
keywords: wb97x-d3
keywords: def2-TZVPP
keywords: def2/J RIJCOSX
keywords: DEFGRID2
keywords: scfconv7
keywords: smallprint printgap noloewdin
keywords: NOSOSCF
formula: C20H18ClF3N2O6
InChI: InChI=1/C20H18ClF3N2O6/c1-5-8-31-17(29)19(2,3)32-16(28)12-9-11(6-7-13(12)21)26-15(27)10-14(20(22,23)24)25(4)18(26)30/h5-7,9-10H,1,8H2,2-4H3
50 atoms
Cl 3.253941 -2.246434 0.395802
F  -6.767261 0.592563 -1.987917
F  -7.265821 -1.049975 -0.707301
F  -6.9814 0.926731 0.113426
O  3.22684 0.41302 -0.884115
O  4.754914 0.981942 1.187488
O  -2.817363 -1.253774 1.885642
O  -2.044485 -0.329123 -2.475523
O  5.251005 3.013156 0.38605
O  2.021421 1.750392 0.444772
N  -2.437142 -0.795743 -0.291028
N  -4.610648 -0.688463 0.60259
C  4.266748 1.387184 -1.08775
C  -1.060256 -1.128306 -0.111153
C  -5.055919 -0.242897 -0.617637
C  -3.263902 -0.929177 0.809383
C  3.785508 2.515894 -1.985041
C  5.401043 0.611307 -1.751034
C  1.24407 -0.443354 -0.016904
C  -0.107502 -0.128347 -0.112556
C  -2.838008 -0.395514 -1.5613
C  -4.240362 -0.081152 -1.669471
C  4.789152 1.910618 0.250383
C  -0.685408 -2.454186 0.021286
C  2.202656 0.69268 -0.102622
C  1.612064 -1.778203 0.147452
C  -5.505153 -0.939359 1.73621
C  0.650485 -2.776152 0.174686
C  -6.531396 0.060727 -0.794575
C  5.312336 1.287971 2.477251
C  6.791117 1.090295 2.472025
C  7.660259 2.037048 2.797478
H  4.628016 3.129671 -2.299426
H  3.332632 2.098166 -2.884316
H  3.058201 3.164966 -1.501936
H  6.250566 1.269584 -1.928333
H  5.737921 -0.223039 -1.135691
H  5.073432 0.218868 -2.714252
H  -0.40963 0.906311 -0.213602
H  -4.592483 0.271872 -2.625293
H  -1.428805 -3.240436 0.010714
H  -5.932458 -0.016912 2.118837
H  -6.290848 -1.636782 1.459431
H  -4.931403 -1.394199 2.533469
H  0.944518 -3.807777 0.30895
H  4.830561 0.580491 3.152439
H  5.037546 2.296313 2.790691
H  7.140537 0.097049 2.206125
H  8.725065 1.842082 2.811405
H  7.344572 3.038564 3.065419
elementType: Cl F O N C H
totalener: -2093.81405374 hartree
nucrepener: 3472.12603402 hartree
electener: -5565.94008775 hartree
oneelecener: -9781.87071408 hartree
twoeener: 4215.93062633 hartree
cpcmener: -0.04563026 hartree
kineticenergy: 2086.83518509 hartree
xcener: -168.848815982364 hartree
chargesum: -0.0000000
charge: -0.061117 -0.159260 -0.160948 -0.162663 -0.275846 -0.263941 -0.464494 -0.460258 -0.430466 -0.431389 -0.063967 -0.095246 0.309791 0.077653 0.010406 0.400352 -0.312749 -0.294730 0.054141 -0.144032 0.346328 -0.154478 0.338630 -0.174831 0.437600 0.030902 -0.206438 -0.116309 0.538761 0.069822 -0.196460 -0.241508 0.106843 0.113901 0.113791 0.113227 0.111947 0.113001 0.144032 0.137550 0.155179 0.139267 0.139650 0.116201 0.140665 0.114769 0.107449 0.139186 0.130834 0.119253
qa: -0.0611 -0.1593 -0.1609 -0.1627 -0.2758 -0.2639 -0.4645 -0.4603 -0.4305 -0.4314 -0.0640 -0.0952 0.3098 0.0777 0.0104 0.4004 -0.3127 -0.2947 0.0541 -0.1440 0.3463 -0.1545 0.3386 -0.1748 0.4376 0.0309 -0.2064 -0.1163 0.5388 0.0698 -0.1965 -0.2415 0.1068 0.1139 0.1138 0.1132 0.1119 0.1130 0.1440 0.1375 0.1552 0.1393 0.1397 0.1162 0.1407 0.1148 0.1074 0.1392 0.1308 0.1193
va: 1.2583 1.1514 1.1455 1.1469 2.1674 2.1452 2.0557 2.0522 2.0885 2.0737 3.1241 3.3410 3.7807 3.6795 3.9838 4.2449 3.9426 3.9260 3.6721 4.1083 4.2114 3.8768 4.2205 4.0986 4.1211 3.9713 3.8387 3.9994 4.4087 3.8463 3.8214 3.9448 1.0101 1.0042 1.0149 1.0079 1.0112 1.0041 1.0253 1.0223 1.0025 0.9922 0.9959 1.0252 1.0095 0.9965 1.0119 1.0030 1.0015 1.0083
dispcorr: -0.027573504 hartree
energy: -2093.841627238994
dipole: 51.46867 -53.07635 -1.60767 10.86798 -12.51422 -1.64624 6.81017 -6.56293 0.24724
magnitude: 2.31427 au
magnitude: 5.88240 debye
