program: Orca
programVersion: 5.0.2
elementType: Cl F F F O O O O O O N N C C C C C C C C C C C C C C C C C C C C H H H H H H H H H H H H H H H H H H
charge: 0
multiplicity: 1
keywords: wb97x-d3
keywords: def2-TZVPP
keywords: def2/J RIJCOSX
keywords: DEFGRID2
keywords: scfconv7
keywords: smallprint printgap noloewdin
keywords: NOSOSCF
formula: C20H18ClF3N2O6
InChI: InChI=1/C20H18ClF3N2O6/c1-5-8-31-17(29)19(2,3)32-16(28)12-9-11(6-7-13(12)21)26-15(27)10-14(20(22,23)24)25(4)18(26)30/h5-7,9-10H,1,8H2,2-4H3
50 atoms
Cl 3.258232 -3.377864 0.685712
F  -6.802331 -0.340019 -0.561409
F  -6.135772 1.702211 -0.354364
F  -6.141359 0.76203 -2.277124
O  2.812142 0.463368 -1.090581
O  3.238585 2.406252 0.682526
O  -2.268069 -0.513634 1.880356
O  -1.671612 -1.113028 -2.563363
O  5.434732 2.361299 0.253511
O  3.851119 -0.478106 0.648261
N  -1.991752 -0.858342 -0.334494
N  -4.036937 -0.076381 0.524076
C  3.908023 1.369631 -1.329246
C  -0.710582 -1.431458 -0.072287
C  -4.491159 0.057344 -0.763686
C  -2.736545 -0.476913 0.765574
C  3.356956 2.414034 -2.293725
C  5.085609 0.636802 -1.950121
C  1.686587 -1.244936 0.020091
C  0.43733 -0.680466 -0.230653
C  -2.402785 -0.767928 -1.659303
C  -3.736915 -0.248022 -1.830606
C  4.300652 2.075491 -0.028897
C  -0.635926 -2.757752 0.317784
C  2.904802 -0.400563 -0.090979
C  1.752366 -2.581357 0.416373
C  -4.822305 0.263888 1.714342
C  0.597201 -3.334249 0.558536
C  -5.905545 0.553044 -0.988316
C  3.43175 3.081753 1.940321
C  3.776698 2.115551 3.024425
C  2.992185 1.893745 4.07105
H  4.111269 3.176718 -2.48557
H  3.104983 1.947041 -3.246365
H  2.466094 2.904847 -1.90205
H  5.556602 -0.073751 -1.272558
H  4.749293 0.099291 -2.837564
H  5.843625 1.352316 -2.26813
H  0.359364 0.356561 -0.529423
H  -4.09828 -0.141072 -2.840885
H  -1.535504 -3.348773 0.429301
H  -4.692696 1.309936 1.984041
H  -5.872324 0.047118 1.568474
H  -4.489987 -0.352763 2.540672
H  0.657576 -4.372991 0.852041
H  2.480615 3.57277 2.142074
H  4.197569 3.853329 1.833883
H  4.725847 1.596154 2.941098
H  3.282848 1.208054 4.856481
H  2.040398 2.399544 4.193071
elementType: Cl F O N C H
totalener: -2093.81590142 hartree
nucrepener: 3527.12318431 hartree
electener: -5620.93908573 hartree
oneelecener: -9891.75762284 hartree
twoeener: 4270.81853712 hartree
cpcmener: -0.04775626 hartree
kineticenergy: 2086.81363865 hartree
xcener: -168.844507790928 hartree
chargesum: -0.0000000
charge: -0.053660 -0.162286 -0.161351 -0.157730 -0.284966 -0.273671 -0.467586 -0.463583 -0.434154 -0.413088 -0.056204 -0.103489 0.320399 0.059512 0.008883 0.411323 -0.298703 -0.312474 0.058791 -0.155941 0.347536 -0.157235 0.346362 -0.166008 0.417934 0.057645 -0.187788 -0.116630 0.535747 0.067948 -0.210199 -0.240008 0.112996 0.111491 0.114760 0.113275 0.112960 0.107202 0.138777 0.138295 0.152713 0.139531 0.126112 0.116593 0.138814 0.114853 0.109076 0.147758 0.131659 0.117809
qa: -0.0537 -0.1623 -0.1614 -0.1577 -0.2850 -0.2737 -0.4676 -0.4636 -0.4342 -0.4131 -0.0562 -0.1035 0.3204 0.0595 0.0089 0.4113 -0.2987 -0.3125 0.0588 -0.1559 0.3475 -0.1572 0.3464 -0.1660 0.4179 0.0576 -0.1878 -0.1166 0.5357 0.0679 -0.2102 -0.2400 0.1130 0.1115 0.1148 0.1133 0.1130 0.1072 0.1388 0.1383 0.1527 0.1395 0.1261 0.1166 0.1388 0.1149 0.1091 0.1478 0.1317 0.1178
va: 1.2652 1.1441 1.1501 1.1533 2.1680 2.1360 2.0476 2.0488 2.0801 2.0717 3.1100 3.3652 3.7706 3.6503 3.9729 4.2325 3.9285 3.9432 3.6633 4.1596 4.2160 3.8727 4.1999 4.1013 4.1599 3.9618 3.8642 4.0014 4.4221 3.8298 3.8021 3.9520 1.0046 1.0038 1.0107 1.0169 1.0045 1.0090 1.0308 1.0220 1.0032 0.9877 1.0090 1.0093 1.0115 1.0028 1.0112 1.0073 1.0020 1.0102
dispcorr: -0.027300619 hartree
energy: -2093.843202036486
dipole: 35.46588 -38.93348 -3.46760 17.73232 -16.86541 0.86692 7.94096 -7.91014 0.03082
magnitude: 3.57445 au
magnitude: 9.08554 debye
