program: Orca
programVersion: 5.0.2
elementType: Cl F F F O O O O O O N N C C C C C C C C C C C C C C C C C C C C H H H H H H H H H H H H H H H H H H
charge: 0
multiplicity: 1
keywords: wb97x-d3
keywords: def2-TZVPP
keywords: def2/J RIJCOSX
keywords: DEFGRID2
keywords: scfconv7
keywords: smallprint printgap noloewdin
keywords: NOSOSCF
formula: C20H18ClF3N2O6
InChI: InChI=1/C20H18ClF3N2O6/c1-5-8-31-17(29)19(2,3)32-16(28)12-9-11(6-7-13(12)21)26-15(27)10-14(20(22,23)24)25(4)18(26)30/h5-7,9-10H,1,8H2,2-4H3
50 atoms
Cl 3.353656 -1.829349 -1.646235
F  -6.598825 0.782111 1.496004
F  -6.95364 0.712468 -0.615039
F  -7.015502 -1.098766 0.519047
O  3.546932 -0.368208 0.806613
O  4.840746 1.772283 -0.177585
O  -2.20142 -1.974886 1.425022
O  -2.344698 0.830631 -2.118594
O  5.173108 2.551009 1.88975
O  2.195487 1.393415 1.024164
N  -2.277995 -0.570434 -0.33812
N  -4.178349 -0.932523 0.999918
C  4.590747 0.230916 1.598479
C  -0.908995 -0.871057 -0.614755
C  -4.895402 -0.133585 0.142896
C  -2.848751 -1.213006 0.743828
C  5.834338 -0.603881 1.311901
C  4.232142 0.178735 3.072766
C  1.436692 -0.483534 -0.206055
C  0.095882 -0.197789 0.048357
C  -2.933179 0.300626 -1.200575
C  -4.334065 0.480281 -0.909161
C  4.869591 1.66243 1.137994
C  -0.600435 -1.827025 -1.566909
C  2.426566 0.290068 0.5943
C  1.73829 -1.441673 -1.177237
C  -4.756991 -1.593797 2.17305
C  0.722869 -2.101574 -1.854609
C  -6.378653 0.064872 0.391972
C  5.11731 3.051198 -0.74486
C  5.050157 2.967762 -2.228958
C  4.777128 1.896693 -2.961237
H  5.68738 -1.62738 1.657371
H  6.074576 -0.628414 0.24944
H  6.689923 -0.19114 1.84575
H  5.076981 0.506265 3.675833
H  3.376536 0.80206 3.325001
H  4.007995 -0.849536 3.355663
H  -0.15816 0.551795 0.786238
H  -4.898927 1.111725 -1.576156
H  -1.386289 -2.354997 -2.090888
H  -5.450027 -0.937237 2.688404
H  -5.251356 -2.524515 1.898885
H  -3.9600 -1.820984 2.872432
H  0.965898 -2.832823 -2.612762
H  6.109823 3.395393 -0.437786
H  4.39569 3.788418 -0.378827
H  5.256273 3.914091 -2.719016
H  4.759859 1.963832 -4.041347
H  4.561288 0.924879 -2.537117
elementType: Cl F O N C H
totalener: -2093.81568112 hartree
nucrepener: 3502.87943256 hartree
electener: -5596.69511368 hartree
oneelecener: -9843.21258461 hartree
twoeener: 4246.51747093 hartree
cpcmener: -0.04586291 hartree
kineticenergy: 2086.80228803 hartree
xcener: -168.846351970692 hartree
chargesum: 0.0000000
charge: -0.063774 -0.161617 -0.159032 -0.161725 -0.277580 -0.263303 -0.468568 -0.462523 -0.429851 -0.437805 -0.056024 -0.101739 0.317227 0.041414 0.010610 0.409344 -0.297723 -0.311700 0.044293 -0.105609 0.350624 -0.158077 0.340532 -0.172313 0.443572 0.039508 -0.196245 -0.102267 0.536660 0.097366 -0.182189 -0.280951 0.111853 0.112413 0.116102 0.106997 0.114000 0.112334 0.137344 0.138229 0.150729 0.132861 0.139395 0.116900 0.140388 0.109040 0.112103 0.133614 0.130777 0.104387
qa: -0.0638 -0.1616 -0.1590 -0.1617 -0.2776 -0.2633 -0.4686 -0.4625 -0.4299 -0.4378 -0.0560 -0.1017 0.3172 0.0414 0.0106 0.4093 -0.2977 -0.3117 0.0443 -0.1056 0.3506 -0.1581 0.3405 -0.1723 0.4436 0.0395 -0.1962 -0.1023 0.5367 0.0974 -0.1822 -0.2810 0.1119 0.1124 0.1161 0.1070 0.1140 0.1123 0.1373 0.1382 0.1507 0.1329 0.1394 0.1169 0.1404 0.1090 0.1121 0.1336 0.1308 0.1044
va: 1.2471 1.1449 1.1513 1.1482 2.1758 2.1497 2.0476 2.0484 2.0902 2.0613 3.1011 3.3554 3.8064 3.6612 3.9752 4.2379 3.9266 3.9433 3.6792 4.1117 4.2164 3.8746 4.1855 4.1298 4.1206 3.9621 3.8548 3.9899 4.4150 3.8426 3.8679 3.9450 1.0039 1.0110 1.0067 1.0099 1.0147 1.0045 1.0333 1.0220 1.0043 1.0039 0.9877 1.0142 1.0098 0.9973 0.9952 1.0011 1.0022 1.0221
dispcorr: -0.028072037 hartree
energy: -2093.843753161389
dipole: 47.99654 -49.37198 -1.37543 5.13721 -6.71983 -1.58262 6.49420 -6.37941 0.11479
magnitude: 2.09992 au
magnitude: 5.33758 debye
