program: Orca
programVersion: 5.0.2
elementType: Cl F F F O O O O O O N N C C C C C C C C C C C C C C C C C C C C H H H H H H H H H H H H H H H H H H
charge: 0
multiplicity: 1
keywords: wb97x-d3
keywords: def2-TZVPP
keywords: def2/J RIJCOSX
keywords: DEFGRID2
keywords: scfconv7
keywords: smallprint printgap noloewdin
keywords: NOSOSCF
formula: C20H18ClF3N2O6
InChI: InChI=1/C20H18ClF3N2O6/c1-5-8-31-17(29)19(2,3)32-16(28)12-9-11(6-7-13(12)21)26-15(27)10-14(20(22,23)24)25(4)18(26)30/h5-7,9-10H,1,8H2,2-4H3
50 atoms
Cl 3.353068 -2.909896 0.221798
F  -6.804836 0.339295 0.409659
F  -6.093784 1.974336 -0.807604
F  -6.716679 0.140025 -1.718973
O  2.376097 1.254459 -0.390526
O  4.413213 1.232513 1.255346
O  -1.85544 0.370958 1.508624
O  -2.427609 -2.031342 -2.282132
O  5.741197 2.268402 -0.214572
O  3.776011 -0.330452 -1.110332
N  -2.139558 -0.809036 -0.393062
N  -3.874591 0.527563 0.469424
C  3.355779 2.294777 -0.56535
C  -0.804028 -1.297781 -0.263839
C  -4.667792 0.11232 -0.572202
C  -2.580869 0.055098 0.593601
C  2.771181 3.510299 0.146556
C  3.59253 2.597193 -2.035097
C  1.573167 -0.925321 -0.406187
C  0.263767 -0.464424 -0.531152
C  -2.89474 -1.26263 -1.46874
C  -4.238235 -0.742218 -1.511956
C  4.651683 1.913121 0.150533
C  -0.590857 -2.605974 0.134944
C  2.701519 0.002456 -0.683983
C  1.778768 -2.249961 -0.01214
C  -4.335588 1.464871 1.497989
C  0.701403 -3.080425 0.258199
C  -6.083299 0.647833 -0.668486
C  5.519293 0.775001 2.028674
C  5.041778 -0.218592 3.028843
C  3.806908 -0.683562 3.16056
H  2.537066 3.299145 1.189978
H  3.480638 4.336627 0.115808
H  1.858724 3.834518 -0.35478
H  4.22044 3.480883 -2.137021
H  4.07319 1.780888 -2.569792
H  2.640593 2.816348 -2.5191
H  0.076195 0.55203 -0.850161
H  -4.86482 -1.067496 -2.326954
H  -1.425701 -3.256609 0.359459
H  -3.520633 1.650288 2.185311
H  -4.618667 2.417111 1.059318
H  -5.160946 1.048225 2.067689
H  0.871428 -4.099403 0.576707
H  5.998454 1.621841 2.529595
H  6.273717 0.315589 1.3830
H  5.826699 -0.580244 3.685276
H  3.5783 -1.41998 3.919867
H  2.97935 -0.359545 2.542929
elementType: Cl F O N C H
totalener: -2093.81546237 hartree
nucrepener: 3549.68108327 hartree
electener: -5643.49654565 hartree
oneelecener: -9936.54511224 hartree
twoeener: 4293.04856659 hartree
cpcmener: -0.04729699 hartree
kineticenergy: 2086.82310583 hartree
xcener: -168.851981824273 hartree
chargesum: -0.0000000
charge: -0.052548 -0.161911 -0.161635 -0.158965 -0.288166 -0.261160 -0.464995 -0.460815 -0.431959 -0.410557 -0.061303 -0.093038 0.316471 0.080307 0.004379 0.399075 -0.292064 -0.312396 0.057105 -0.143384 0.345476 -0.151657 0.336170 -0.179989 0.415684 0.025651 -0.208228 -0.097527 0.540598 0.089991 -0.174078 -0.297634 0.116545 0.110561 0.110925 0.108304 0.115566 0.112394 0.141446 0.138310 0.155160 0.116531 0.139672 0.139793 0.138074 0.116455 0.108015 0.134239 0.132145 0.118966
qa: -0.0525 -0.1619 -0.1616 -0.1590 -0.2882 -0.2612 -0.4650 -0.4608 -0.4320 -0.4106 -0.0613 -0.0930 0.3165 0.0803 0.0044 0.3991 -0.2921 -0.3124 0.0571 -0.1434 0.3455 -0.1517 0.3362 -0.1800 0.4157 0.0257 -0.2082 -0.0975 0.5406 0.0900 -0.1741 -0.2976 0.1165 0.1106 0.1109 0.1083 0.1156 0.1124 0.1414 0.1383 0.1552 0.1165 0.1397 0.1398 0.1381 0.1165 0.1080 0.1342 0.1321 0.1190
va: 1.2612 1.1466 1.1461 1.1520 2.1341 2.1474 2.0557 2.0513 2.0872 2.0808 3.1223 3.3423 3.7960 3.6717 3.9860 4.2439 3.9235 3.9383 3.6135 4.1229 4.2136 3.8707 4.1995 4.1123 4.1565 3.9698 3.8361 3.9940 4.4075 3.8502 3.8379 3.9477 1.0115 1.0063 1.0025 1.0101 1.0147 1.0033 1.0322 1.0217 1.0023 1.0266 0.9948 0.9937 1.0119 0.9951 0.9987 1.0026 1.0026 1.0119
dispcorr: -0.028838784 hartree
energy: -2093.844301154732
dipole: 37.26423 -40.24703 -2.98280 17.07471 -15.82668 1.24803 12.17540 -10.64513 1.53027
magnitude: 3.57720 au
magnitude: 9.09253 debye
