program: Orca
programVersion: 5.0.2
elementType: Cl F F F O O O O O O N N C C C C C C C C C C C C C C C C C C C C H H H H H H H H H H H H H H H H H H
charge: 0
multiplicity: 1
keywords: wb97x-d3
keywords: def2-TZVPP
keywords: def2/J RIJCOSX
keywords: DEFGRID2
keywords: scfconv7
keywords: smallprint printgap noloewdin
keywords: NOSOSCF
formula: C20H18ClF3N2O6
InChI: InChI=1/C20H18ClF3N2O6/c1-5-8-31-17(29)19(2,3)32-16(28)12-9-11(6-7-13(12)21)26-15(27)10-14(20(22,23)24)25(4)18(26)30/h5-7,9-10H,1,8H2,2-4H3
50 atoms
Cl 3.450213 -3.319213 -0.368245
F  -5.708842 2.126574 -0.65451
F  -6.738439 0.252796 -0.541864
F  -5.9589 1.175623 1.247995
O  3.827004 -0.414853 -0.085092
O  3.311464 2.080713 -0.665451
O  -2.5774 -2.350331 1.283909
O  -1.365729 0.469461 -2.047897
O  4.811958 2.847983 0.806968
O  2.574323 0.333632 1.608682
N  -1.965615 -0.941821 -0.375679
N  -4.138796 -0.892601 0.521252
C  4.886201 0.52734 0.165879
C  -0.659211 -1.51719 -0.371664
C  -4.393889 0.228123 -0.228617
C  -2.876209 -1.452284 0.53074
C  5.809159 0.396818 -1.04126
C  5.635693 0.208719 1.447879
C  1.683175 -1.304005 0.146048
C  0.387156 -0.799963 0.173533
C  -2.208637 0.109792 -1.253907
C  -3.501992 0.72762 -1.096641
C  4.322014 1.949746 0.175155
C  -0.438382 -2.7668 -0.923756
C  2.741549 -0.393438 0.662278
C  1.89429 -2.574045 -0.388775
C  -5.114904 -1.539943 1.40171
C  0.837213 -3.303275 -0.911411
C  -5.714816 0.948114 -0.042658
C  2.671681 3.364748 -0.767646
C  1.808882 3.645604 0.416737
C  1.887326 4.760928 1.128909
H  6.61468 1.127284 -0.975558
H  6.257632 -0.596563 -1.062195
H  5.277502 0.556759 -1.978977
H  6.527908 0.828037 1.518212
H  5.043951 0.37033 2.345379
H  5.961067 -0.831285 1.42972
H  0.202224 0.175486 0.604939
H  -3.702196 1.6072 -1.68751
H  -1.253122 -3.330661 -1.35815
H  -4.930585 -2.609039 1.402242
H  -5.036489 -1.170372 2.422011
H  -6.123535 -1.399625 1.034221
H  1.008347 -4.291179 -1.31611
H  2.06556 3.284265 -1.670382
H  3.411336 4.151837 -0.926045
H  1.057497 2.898242 0.654072
H  1.210531 4.952516 1.951535
H  2.623714 5.526796 0.914614
elementType: Cl F O N C H
totalener: -2093.81441691 hartree
nucrepener: 3547.10586771 hartree
electener: -5640.92028461 hartree
oneelecener: -9931.70542531 hartree
twoeener: 4290.78514070 hartree
cpcmener: -0.04701719 hartree
kineticenergy: 2086.83673364 hartree
xcener: -168.848743754170 hartree
chargesum: 0.0000000
charge: -0.058164 -0.158548 -0.161930 -0.161497 -0.279266 -0.272061 -0.467085 -0.461025 -0.427108 -0.429630 -0.060333 -0.102649 0.309381 0.079730 0.009543 0.412027 -0.290304 -0.306884 0.091810 -0.166974 0.349294 -0.164493 0.327713 -0.184192 0.420076 0.029686 -0.186245 -0.105158 0.538367 0.064910 -0.198552 -0.242997 0.109740 0.109946 0.116400 0.108060 0.115307 0.110382 0.145537 0.137937 0.153967 0.114828 0.138092 0.127813 0.140624 0.119333 0.111811 0.144600 0.130118 0.118062
qa: -0.0582 -0.1585 -0.1619 -0.1615 -0.2793 -0.2721 -0.4671 -0.4610 -0.4271 -0.4296 -0.0603 -0.1026 0.3094 0.0797 0.0095 0.4120 -0.2903 -0.3069 0.0918 -0.1670 0.3493 -0.1645 0.3277 -0.1842 0.4201 0.0297 -0.1862 -0.1052 0.5384 0.0649 -0.1986 -0.2430 0.1097 0.1099 0.1164 0.1081 0.1153 0.1104 0.1455 0.1379 0.1540 0.1148 0.1381 0.1278 0.1406 0.1193 0.1118 0.1446 0.1301 0.1181
va: 1.2592 1.1524 1.1444 1.1489 2.1630 2.1436 2.0506 2.0498 2.0911 2.0789 3.1234 3.3551 3.8003 3.6721 3.9700 4.2316 3.9234 3.9333 3.6476 4.1367 4.2102 3.8778 4.2264 4.1058 4.1392 3.9817 3.8670 3.9792 4.4185 3.8465 3.8031 3.9531 1.0075 1.0036 1.0125 1.0108 1.0163 1.0052 1.0224 1.0222 1.0035 1.0064 0.9886 1.0090 1.0088 0.9953 1.0086 0.9997 1.0024 1.0071
dispcorr: -0.028307447 hartree
energy: -2093.842724354367
dipole: 37.17266 -39.32263 -2.14996 11.81504 -12.53198 -0.71694 3.60255 -4.59471 -0.99216
magnitude: 2.47401 au
magnitude: 6.28843 debye
