program: Orca
programVersion: 5.0.2
elementType: Cl F F F O O O O O O N N C C C C C C C C C C C C C C C C C C C C H H H H H H H H H H H H H H H H H H
charge: 0
multiplicity: 1
keywords: wb97x-d3
keywords: def2-TZVPP
keywords: def2/J RIJCOSX
keywords: DEFGRID2
keywords: scfconv7
keywords: smallprint printgap noloewdin
keywords: NOSOSCF
formula: C20H18ClF3N2O6
InChI: InChI=1/C20H18ClF3N2O6/c1-5-8-31-17(29)19(2,3)32-16(28)12-9-11(6-7-13(12)21)26-15(27)10-14(20(22,23)24)25(4)18(26)30/h5-7,9-10H,1,8H2,2-4H3
50 atoms
Cl 3.41457 -3.2352 -0.592663
F  -6.827607 0.135189 -0.338865
F  -6.053231 1.012989 1.474963
F  -5.851587 2.038317 -0.394245
O  3.782611 -0.429178 0.10207
O  3.310808 2.12216 -0.278241
O  -2.603205 -2.489775 1.255923
O  -1.474529 0.572576 -1.881474
O  4.674459 2.714675 1.396292
O  2.446657 0.211506 1.773106
N  -2.037248 -0.957362 -0.304566
N  -4.193737 -0.991777 0.63363
C  4.824662 0.485827 0.491452
C  -0.722952 -1.512452 -0.364851
C  -4.479081 0.162894 -0.052581
C  -2.926561 -1.54042 0.579473
C  5.798984 0.486315 -0.681386
C  5.514865 0.034824 1.766845
C  1.619439 -1.319494 0.168416
C  0.3137 -0.846337 0.257385
C  -2.304363 0.147162 -1.106339
C  -3.607583 0.72879 -0.90023
C  4.249495 1.897832 0.621674
C  -0.482546 -2.680956 -1.065713
C  2.658002 -0.452982 0.7894
C  1.850283 -2.511739 -0.517832
C  -5.149467 -1.684029 1.503525
C  0.802857 -3.190284 -1.122703
C  -5.817328 0.838992 0.174943
C  2.678709 3.41597 -0.318593
C  3.480097 4.384362 -1.122231
C  3.047798 4.899124 -2.265939
H  6.23695 -0.504638 -0.804587
H  5.312058 0.768135 -1.615082
H  6.609263 1.189869 -0.492824
H  6.405326 0.636965 1.941488
H  4.881155 0.109835 2.647916
H  5.836999 -1.001017 1.658782
H  0.113604 0.068302 0.800446
H  -3.833274 1.634617 -1.44005
H  -1.289062 -3.201149 -1.565129
H  -5.120444 -1.291627 2.517875
H  -6.154873 -1.616016 1.105106
H  -4.89517 -2.737264 1.532075
H  0.99075 -4.116703 -1.647498
H  2.514056 3.779086 0.69798
H  1.707102 3.238485 -0.777726
H  4.446056 4.678146 -0.724295
H  3.63751 5.618761 -2.819354
H  2.086578 4.630056 -2.688778
elementType: Cl F O N C H
totalener: -2093.81483168 hartree
nucrepener: 3512.89377396 hartree
electener: -5606.70860564 hartree
oneelecener: -9863.17171551 hartree
twoeener: 4256.46310987 hartree
cpcmener: -0.04504827 hartree
kineticenergy: 2086.82402534 hartree
xcener: -168.846032408903 hartree
chargesum: 0.0000000
charge: -0.057472 -0.161823 -0.161159 -0.158932 -0.281133 -0.271795 -0.468129 -0.463506 -0.434531 -0.434908 -0.058969 -0.101426 0.316287 0.071739 0.009503 0.410613 -0.288847 -0.308258 0.058257 -0.144647 0.351749 -0.161672 0.336776 -0.175398 0.441455 0.033518 -0.193176 -0.105983 0.537987 0.071011 -0.205077 -0.243016 0.109943 0.114574 0.109749 0.108225 0.114495 0.110682 0.139130 0.137974 0.152880 0.139168 0.131918 0.115229 0.139953 0.108449 0.111733 0.145901 0.131456 0.119501
qa: -0.0575 -0.1618 -0.1612 -0.1589 -0.2811 -0.2718 -0.4681 -0.4635 -0.4345 -0.4349 -0.0590 -0.1014 0.3163 0.0717 0.0095 0.4106 -0.2888 -0.3083 0.0583 -0.1446 0.3517 -0.1617 0.3368 -0.1754 0.4415 0.0335 -0.1932 -0.1060 0.5380 0.0710 -0.2051 -0.2430 0.1099 0.1146 0.1097 0.1082 0.1145 0.1107 0.1391 0.1380 0.1529 0.1392 0.1319 0.1152 0.1400 0.1084 0.1117 0.1459 0.1315 0.1195
va: 1.2586 1.1447 1.1488 1.1516 2.1684 2.1377 2.0484 2.0449 2.0809 2.0733 3.1157 3.3535 3.8032 3.6563 3.9753 4.2354 3.9161 3.9370 3.6903 4.1251 4.2064 3.8773 4.2094 4.1161 4.1179 3.9773 3.8601 3.9817 4.4153 3.8292 3.8265 3.9532 1.0041 1.0145 1.0072 1.0096 1.0151 1.0054 1.0302 1.0222 1.0038 0.9881 1.0056 1.0111 1.0094 1.0111 1.0042 1.0054 1.0018 1.0099
dispcorr: -0.027297106 hartree
energy: -2093.842128789073
dipole: 40.38488 -42.41511 -2.03023 12.71228 -13.32986 -0.61759 -1.31323 0.21824 -1.09500
magnitude: 2.38794 au
magnitude: 6.06966 debye
