program: Orca
programVersion: 5.0.2
elementType: Cl F F F O O O O O O N N C C C C C C C C C C C C C C C C C C C C H H H H H H H H H H H H H H H H H H
charge: 0
multiplicity: 1
keywords: wb97x-d3
keywords: def2-TZVPP
keywords: def2/J RIJCOSX
keywords: DEFGRID2
keywords: scfconv7
keywords: smallprint printgap noloewdin
keywords: NOSOSCF
formula: C20H18ClF3N2O6
InChI: InChI=1/C20H18ClF3N2O6/c1-5-8-31-17(29)19(2,3)32-16(28)12-9-11(6-7-13(12)21)26-15(27)10-14(20(22,23)24)25(4)18(26)30/h5-7,9-10H,1,8H2,2-4H3
50 atoms
Cl 3.4469 -3.249682 -0.645052
F  -6.639365 0.289048 -1.179082
F  -6.472339 0.270116 0.955461
F  -5.864681 2.010885 -0.168278
O  3.832237 -0.451319 0.042726
O  3.418575 1.67414 1.542175
O  -1.619547 -0.316486 1.695561
O  -2.391726 -1.624196 -2.569369
O  4.854869 2.893381 0.331727
O  2.642883 0.938175 -1.235964
N  -1.999049 -0.94798 -0.440555
N  -3.612613 0.260162 0.771517
C  4.919872 0.485756 0.166486
C  -0.681223 -1.49482 -0.488255
C  -4.474422 0.109436 -0.286399
C  -2.366575 -0.335392 0.744109
C  5.688335 0.617058 -1.136807
C  5.810462 -0.095529 1.259786
C  1.698447 -1.143766 -0.622936
C  0.398769 -0.646458 -0.622046
C  -2.802244 -1.076176 -1.568517
C  -4.125839 -0.521579 -1.41808
C  4.384587 1.834945 0.654844
C  -0.489091 -2.861454 -0.392104
C  2.7743 -0.11694 -0.667205
C  1.884096 -2.524955 -0.547001
C  -3.94818 0.971118 2.008601
C  0.79436 -3.376137 -0.441956
C  -5.875094 0.675753 -0.165435
C  2.813563 2.844715 2.117945
C  1.845909 3.480819 1.175773
C  1.893321 4.763012 0.839881
H  6.612897 1.165147 -0.967587
H  5.958174 -0.373943 -1.500191
H  5.13145 1.131027 -1.916113
H  6.64799 0.573253 1.453327
H  5.268543 -0.244527 2.193351
H  6.215187 -1.0556 0.939001
H  0.236763 0.420669 -0.701975
H  -4.805619 -0.63651 -2.247751
H  -1.332166 -3.529947 -0.279631
H  -3.034371 1.344372 2.454921
H  -4.570727 1.834154 1.805775
H  -4.441971 0.314421 2.722576
H  0.945917 -4.445355 -0.391135
H  3.57801 3.549827 2.451036
H  2.295402 2.466316 3.00007
H  1.051606 2.843945 0.797008
H  1.145942 5.20414 0.192932
H  2.670983 5.423825 1.207263
elementType: Cl F O N C H
totalener: -2093.81506639 hartree
nucrepener: 3545.99032188 hartree
electener: -5639.80538827 hartree
oneelecener: -9929.34398153 hartree
twoeener: 4289.53859326 hartree
cpcmener: -0.04748009 hartree
kineticenergy: 2086.82472609 hartree
xcener: -168.847350254715 hartree
chargesum: 0.0000000
charge: -0.057436 -0.158351 -0.161815 -0.162046 -0.279044 -0.270035 -0.467889 -0.462257 -0.425916 -0.433547 -0.059186 -0.102132 0.310859 0.071715 0.009099 0.410579 -0.308521 -0.290646 0.074216 -0.147931 0.347248 -0.157452 0.325186 -0.182796 0.435862 0.027872 -0.191197 -0.102147 0.536701 0.065886 -0.196639 -0.242782 0.108914 0.110312 0.114922 0.110594 0.115371 0.109726 0.140473 0.138431 0.154417 0.115641 0.130300 0.138643 0.138988 0.108652 0.117886 0.142131 0.130144 0.118994
qa: -0.0574 -0.1584 -0.1618 -0.1620 -0.2790 -0.2700 -0.4679 -0.4623 -0.4259 -0.4335 -0.0592 -0.1021 0.3109 0.0717 0.0091 0.4106 -0.3085 -0.2906 0.0742 -0.1479 0.3472 -0.1575 0.3252 -0.1828 0.4359 0.0279 -0.1912 -0.1021 0.5367 0.0659 -0.1966 -0.2428 0.1089 0.1103 0.1149 0.1106 0.1154 0.1097 0.1405 0.1384 0.1544 0.1156 0.1303 0.1386 0.1390 0.1087 0.1179 0.1421 0.1301 0.1190
va: 1.2582 1.1526 1.1486 1.1442 2.1703 2.1449 2.0473 2.0502 2.0919 2.0735 3.1194 3.3577 3.7993 3.6743 3.9742 4.2323 3.9350 3.9220 3.6541 4.1217 4.2159 3.8711 4.2288 4.1169 4.1256 3.9829 3.8599 3.9793 4.4172 3.8505 3.8050 3.9498 1.0086 1.0060 1.0158 1.0064 1.0131 1.0038 1.0277 1.0214 1.0028 1.0114 1.0062 0.9878 1.0098 1.0091 0.9948 1.0006 1.0021 1.0071
dispcorr: -0.028195391 hartree
energy: -2093.843261776964
dipole: 40.65281 -42.37111 -1.71830 16.77587 -17.12361 -0.34774 12.02203 -9.94227 2.07976
magnitude: 2.72009 au
magnitude: 6.91392 debye
