program: Orca
programVersion: 5.0.2
elementType: Cl F F F O O O O O O N N C C C C C C C C C C C C C C C C C C C C H H H H H H H H H H H H H H H H H H
charge: 0
multiplicity: 1
keywords: wb97x-d3
keywords: def2-TZVPP
keywords: def2/J RIJCOSX
keywords: DEFGRID2
keywords: scfconv7
keywords: smallprint printgap noloewdin
keywords: NOSOSCF
formula: C20H18ClF3N2O6
InChI: InChI=1/C20H18ClF3N2O6/c1-5-8-31-17(29)19(2,3)32-16(28)12-9-11(6-7-13(12)21)26-15(27)10-14(20(22,23)24)25(4)18(26)30/h5-7,9-10H,1,8H2,2-4H3
50 atoms
Cl 3.290761 -2.861819 0.650156
F  -6.986345 -0.465164 -0.438454
F  -6.398425 1.60844 -0.318913
F  -6.4233 0.604588 -2.208744
O  2.42961 1.238687 -0.442937
O  4.52913 1.421022 1.125872
O  -2.375291 -0.383866 1.86259
O  -1.892834 -1.090503 -2.581362
O  5.826013 2.154686 -0.54009
O  3.788953 -0.458573 -0.941651
N  -2.145701 -0.764252 -0.352005
N  -4.200389 -0.056389 0.550152
C  3.426646 2.215815 -0.800276
C  -0.820493 -1.242216 -0.118079
C  -4.700128 0.017863 -0.725865
C  -2.876977 -0.39351 0.761741
C  2.893109 3.537643 -0.258613
C  3.609901 2.288913 -2.306586
C  1.565924 -0.912324 -0.206414
C  0.267578 -0.438704 -0.394845
C  -2.606696 -0.745253 -1.663529
C  -3.967846 -0.291457 -1.806599
C  4.74151 1.905445 -0.082549
C  -0.640723 -2.526102 0.367484
C  2.72073 -0.04819 -0.56984
C  1.735623 -2.20413 0.298192
C  -4.966861 0.284256 1.752923
C  0.638245 -3.000389 0.588325
C  -6.140228 0.448384 -0.921302
C  5.645798 1.017772 1.912693
C  5.161687 0.221899 3.074181
C  3.911487 -0.14792 3.318704
H  2.692111 3.489829 0.81159
H  3.617163 4.332302 -0.435949
H  1.969932 3.806051 -0.773525
H  2.63986 2.43281 -2.783357
H  4.230119 3.146109 -2.565059
H  4.07432 1.400052 -2.728541
H  0.103898 0.560685 -0.77497
H  -4.36638 -0.235573 -2.80695
H  -1.491834 -3.159991 0.579137
H  -6.003805 -0.015374 1.655124
H  -4.559417 -0.26767 2.593069
H  -4.903073 1.349648 1.96987
H  0.7803 -3.995803 0.98539
H  6.199519 1.897076 2.256534
H  6.33842 0.416208 1.315439
H  5.952211 -0.075276 3.755988
H  3.680872 -0.740147 4.194762
H  3.075421 0.114464 2.683358
elementType: Cl F O N C H
totalener: -2093.81632484 hartree
nucrepener: 3533.81559405 hartree
electener: -5627.63191889 hartree
oneelecener: -9904.84997092 hartree
twoeener: 4277.21805204 hartree
cpcmener: -0.04782402 hartree
kineticenergy: 2086.79986857 hartree
xcener: -168.846755983434 hartree
chargesum: -0.0000000
charge: -0.053631 -0.162223 -0.161175 -0.158197 -0.289648 -0.261577 -0.467250 -0.462597 -0.432221 -0.411397 -0.057929 -0.103023 0.315071 0.068388 0.009225 0.409758 -0.294064 -0.313799 0.048708 -0.146480 0.346864 -0.156569 0.338424 -0.173496 0.424287 0.040294 -0.190489 -0.101722 0.536135 0.089543 -0.174739 -0.295840 0.116515 0.111318 0.111227 0.113149 0.109112 0.115893 0.140596 0.137757 0.154247 0.128261 0.116577 0.139960 0.138729 0.117784 0.107785 0.133703 0.132351 0.116407
qa: -0.0536 -0.1622 -0.1612 -0.1582 -0.2896 -0.2616 -0.4673 -0.4626 -0.4322 -0.4114 -0.0579 -0.1030 0.3151 0.0684 0.0092 0.4098 -0.2941 -0.3138 0.0487 -0.1465 0.3469 -0.1566 0.3384 -0.1735 0.4243 0.0403 -0.1905 -0.1017 0.5361 0.0895 -0.1747 -0.2958 0.1165 0.1113 0.1112 0.1131 0.1091 0.1159 0.1406 0.1378 0.1542 0.1283 0.1166 0.1400 0.1387 0.1178 0.1078 0.1337 0.1324 0.1164
va: 1.2599 1.1442 1.1503 1.1527 2.1370 2.1464 2.0485 2.0496 2.0874 2.0799 3.1153 3.3627 3.7963 3.6632 3.9745 4.2348 3.9238 3.9391 3.6238 4.1427 4.2159 3.8712 4.2034 4.1124 4.1441 3.9633 3.8603 3.9965 4.4199 3.8494 3.8400 3.9472 1.0114 1.0060 1.0022 1.0035 1.0089 1.0139 1.0325 1.0222 1.0027 1.0074 1.0110 0.9874 1.0117 0.9947 0.9988 1.0029 1.0021 1.0142
dispcorr: -0.028558941 hartree
energy: -2093.844883778725
dipole: 36.95631 -40.19344 -3.23713 16.34238 -15.49653 0.84584 11.66336 -10.19250 1.47087
magnitude: 3.65485 au
magnitude: 9.28989 debye
