program: Orca
programVersion: 5.0.2
elementType: Cl F F F O O O O O O N N C C C C C C C C C C C C C C C C C C C C H H H H H H H H H H H H H H H H H H
charge: 0
multiplicity: 1
keywords: wb97x-d3
keywords: def2-TZVPP
keywords: def2/J RIJCOSX
keywords: DEFGRID2
keywords: scfconv7
keywords: smallprint printgap noloewdin
keywords: NOSOSCF
formula: C20H18ClF3N2O6
InChI: InChI=1/C20H18ClF3N2O6/c1-5-8-31-17(29)19(2,3)32-16(28)12-9-11(6-7-13(12)21)26-15(27)10-14(20(22,23)24)25(4)18(26)30/h5-7,9-10H,1,8H2,2-4H3
50 atoms
Cl 3.455767 -3.121396 -0.589252
F  -5.85737 2.106245 -0.376162
F  -6.57428 0.424648 -1.492058
F  -6.587454 0.352146 0.647556
O  3.8924 -0.31034 -0.159004
O  3.599347 1.817931 1.351264
O  -1.747676 -0.239606 1.707003
O  -2.274661 -1.530602 -2.595673
O  4.946521 3.039389 0.050059
O  2.559598 1.086379 -1.274928
N  -2.00499 -0.854046 -0.449658
N  -3.699659 0.317922 0.682293
C  4.979254 0.635051 -0.150377
C  -0.6794 -1.383333 -0.444121
C  -4.491927 0.186278 -0.431462
C  -2.443254 -0.257179 0.716625
C  5.598995 0.773493 -1.530374
C  5.989674 0.061995 0.83756
C  1.698099 -1.014394 -0.614505
C  0.391668 -0.529783 -0.604921
C  -2.74386 -0.984191 -1.620166
C  -4.072982 -0.431178 -1.546174
C  4.494689 1.979455 0.395117
C  -0.474924 -2.745005 -0.307024
C  2.758512 0.022471 -0.741896
C  1.89524 -2.391998 -0.494972
C  -4.131155 0.980405 1.916483
C  0.812582 -3.247561 -0.34572
C  -5.890709 0.772011 -0.408064
C  3.024762 2.970271 1.960512
C  1.795357 2.578483 2.704377
C  1.220715 1.383146 2.731436
H  6.521661 1.34881 -1.468609
H  5.855602 -0.214647 -1.91298
H  4.946117 1.263322 -2.249614
H  6.832023 0.744437 0.945728
H  5.551545 -0.100135 1.822307
H  6.374509 -0.889319 0.468788
H  0.217549 0.532717 -0.713571
H  -4.696805 -0.530466 -2.420076
H  -1.312052 -3.418329 -0.178101
H  -4.735027 1.853782 1.700333
H  -4.679434 0.295122 2.560296
H  -3.254853 1.330182 2.449323
H  0.974264 -4.313239 -0.261655
H  2.773767 3.72083 1.204923
H  3.749959 3.430117 2.638954
H  1.350163 3.399528 3.257387
H  0.320195 1.226567 3.310311
H  1.614749 0.519217 2.212016
elementType: Cl F O N C H
totalener: -2093.81606825 hartree
nucrepener: 3570.77528700 hartree
electener: -5664.59135525 hartree
oneelecener: -9978.83476611 hartree
twoeener: 4314.24341085 hartree
cpcmener: -0.04541523 hartree
kineticenergy: 2086.81690397 hartree
xcener: -168.849706908873 hartree
chargesum: 0.0000000
charge: -0.055538 -0.161955 -0.158703 -0.161314 -0.280268 -0.263014 -0.473139 -0.462921 -0.431405 -0.434398 -0.058475 -0.101457 0.309392 0.092903 0.010041 0.416651 -0.309991 -0.290728 0.057501 -0.166298 0.347711 -0.153806 0.335840 -0.181799 0.442634 0.038129 -0.190907 -0.104032 0.535697 0.094303 -0.171669 -0.299860 0.108747 0.111334 0.115306 0.111764 0.116670 0.109567 0.137042 0.138183 0.153349 0.128697 0.138641 0.116988 0.137785 0.104870 0.116537 0.133543 0.131138 0.120713
qa: -0.0555 -0.1620 -0.1587 -0.1613 -0.2803 -0.2630 -0.4731 -0.4629 -0.4314 -0.4344 -0.0585 -0.1015 0.3094 0.0929 0.0100 0.4167 -0.3100 -0.2907 0.0575 -0.1663 0.3477 -0.1538 0.3358 -0.1818 0.4426 0.0381 -0.1909 -0.1040 0.5357 0.0943 -0.1717 -0.2999 0.1087 0.1113 0.1153 0.1118 0.1167 0.1096 0.1370 0.1382 0.1533 0.1287 0.1386 0.1170 0.1378 0.1049 0.1165 0.1335 0.1311 0.1207
va: 1.2601 1.1444 1.1518 1.1496 2.1598 2.1487 2.0381 2.0487 2.0874 2.0669 3.1099 3.3604 3.8171 3.6215 3.9720 4.2160 3.9358 3.9219 3.6086 4.0907 4.2138 3.8721 4.2003 4.1302 4.1181 3.9845 3.8631 3.9820 4.4190 3.8505 3.8489 3.9453 1.0090 1.0055 1.0150 1.0069 1.0114 1.0037 1.0380 1.0219 1.0030 1.0064 0.9878 1.0101 1.0109 1.0006 0.9942 1.0024 1.0061 1.0101
dispcorr: -0.029561347 hartree
energy: -2093.845629595042
dipole: 39.69729 -41.31841 -1.62112 11.11393 -11.48812 -0.37419 14.93124 -13.01627 1.91497
magnitude: 2.53676 au
magnitude: 6.44793 debye
