program: Orca
programVersion: 5.0.2
elementType: Cl F F F O O O O O O N N C C C C C C C C C C C C C C C C C C C C H H H H H H H H H H H H H H H H H H
charge: 0
multiplicity: 1
keywords: wb97x-d3
keywords: def2-TZVPP
keywords: def2/J RIJCOSX
keywords: DEFGRID2
keywords: scfconv7
keywords: smallprint printgap noloewdin
keywords: NOSOSCF
formula: C20H18ClF3N2O6
InChI: InChI=1/C20H18ClF3N2O6/c1-5-8-31-17(29)19(2,3)32-16(28)12-9-11(6-7-13(12)21)26-15(27)10-14(20(22,23)24)25(4)18(26)30/h5-7,9-10H,1,8H2,2-4H3
50 atoms
Cl 3.397836 -3.538623 0.553084
F  -5.495711 2.2271 -0.808276
F  -5.986959 0.748158 -2.278313
F  -6.49771 0.405419 -0.224653
O  2.893065 0.476996 -1.030269
O  3.154668 2.062069 1.05032
O  -1.920967 -0.326411 1.776092
O  -1.740831 -1.565867 -2.5800
O  5.29057 2.518322 0.55804
O  4.059199 -0.684994 0.484069
N  -1.82043 -0.92877 -0.400496
N  -3.661805 0.280585 0.440805
C  3.899962 1.493805 -1.120128
C  -0.553183 -1.543344 -0.160614
C  -4.221871 0.243796 -0.814985
C  -2.430537 -0.324607 0.685328
C  3.251864 2.611988 -1.933636
C  5.152246 0.982362 -1.81627
C  1.851904 -1.37875 -0.085883
C  0.602991 -0.810742 -0.326169
C  -2.336781 -1.003659 -1.698547
C  -3.622021 -0.352784 -1.854148
C  4.226241 2.054994 0.265801
C  -0.487191 -2.871646 0.217735
C  3.066945 -0.522314 -0.166565
C  1.909376 -2.720716 0.293682
C  -4.326331 0.86759 1.60457
C  0.743497 -3.460604 0.433749
C  -5.564411 0.912451 -1.03157
C  3.313814 2.557103 2.371738
C  2.072824 2.309673 3.159231
C  1.005217 1.625411 2.776047
H  3.008371 2.254514 -2.934189
H  2.337223 2.973798 -1.464853
H  3.941844 3.448671 -2.033654
H  5.840945 1.805787 -1.994861
H  5.676396 0.231033 -1.232163
H  4.883484 0.553936 -2.782019
H  0.535736 0.223756 -0.632262
H  -4.063009 -0.373905 -2.836855
H  -1.392494 -3.450846 0.339929
H  -4.723217 1.850541 1.375659
H  -5.123556 0.223702 1.971309
H  -3.589649 0.978915 2.390663
H  0.805298 -4.502037 0.715215
H  3.53909 3.628426 2.344968
H  4.166798 2.07124 2.855974
H  2.099752 2.742484 4.154396
H  0.163462 1.491157 3.439987
H  0.922077 1.158923 1.805477
totalener: -2093.78462025 hartree
nucrepener: 3580.68500681 hartree
electener: -5674.46962705 hartree
oneelecener: -9998.13692682 hartree
twoeener: 4323.66729977 hartree
kineticenergy: 2086.89871918 hartree
xcener: -168.852100370971 hartree
chargesum: -0.0000000
charge: -0.025906 -0.158636 -0.151201 -0.157099 -0.281332 -0.264432 -0.382776 -0.337439 -0.341354 -0.337355 -0.112973 -0.127284 0.296045 0.187185 -0.027644 0.353607 -0.295362 -0.295328 0.086399 -0.207567 0.276737 -0.157421 0.288945 -0.150501 0.337563 0.048521 -0.210563 -0.106977 0.540841 0.086313 -0.143911 -0.222129 0.103726 0.106655 0.107686 0.100662 0.121858 0.099755 0.117249 0.134723 0.111140 0.126441 0.126771 0.125659 0.114247 0.094057 0.099644 0.103533 0.111091 0.088141
qa: -0.0259 -0.1586 -0.1512 -0.1571 -0.2813 -0.2644 -0.3828 -0.3374 -0.3414 -0.3374 -0.1130 -0.1273 0.2960 0.1872 -0.0276 0.3536 -0.2954 -0.2953 0.0864 -0.2076 0.2767 -0.1574 0.2889 -0.1505 0.3376 0.0485 -0.2106 -0.1070 0.5408 0.0863 -0.1439 -0.2221 0.1037 0.1067 0.1077 0.1007 0.1219 0.0998 0.1172 0.1347 0.1111 0.1264 0.1268 0.1257 0.1142 0.0941 0.0996 0.1035 0.1111 0.0881
va: 1.2952 1.1496 1.1610 1.1516 2.1373 2.1385 2.1198 2.1711 2.1782 2.1376 3.0607 3.3079 3.8651 3.6143 3.9705 4.2540 3.9217 3.9381 3.6487 4.1934 4.2796 3.8350 4.2285 4.1895 4.2310 4.0520 3.8560 4.0297 4.4099 3.8675 3.8859 3.9718 1.0066 1.0121 1.0087 1.0139 1.0190 1.0050 1.0370 1.0248 1.0158 1.0031 0.9910 1.0229 1.0225 0.9970 0.9995 1.0063 1.0112 1.0212
dispcorr: -0.029085160 hartree
energy: -2093.813705405605
dipole: 30.10083 -32.23369 -2.13287 18.02935 -17.31735 0.71200 8.10946 -7.93963 0.16982
magnitude: 2.25497 au
magnitude: 5.73169 debye
