program: Orca
programVersion: 5.0.2
elementType: Cl F F F O O O O O O N N C C C C C C C C C C C C C C C C C C C C H H H H H H H H H H H H H H H H H H
charge: 0
multiplicity: 1
keywords: wb97x-d3
keywords: def2-TZVPP
keywords: def2/J RIJCOSX
keywords: DEFGRID2
keywords: scfconv7
keywords: smallprint printgap noloewdin
keywords: NOSOSCF
formula: C20H18ClF3N2O6
InChI: InChI=1/C20H18ClF3N2O6/c1-5-8-31-17(29)19(2,3)32-16(28)12-9-11(6-7-13(12)21)26-15(27)10-14(20(22,23)24)25(4)18(26)30/h5-7,9-10H,1,8H2,2-4H3
50 atoms
Cl 3.361068 -2.777867 -0.480172
F  -6.82663 0.367557 -1.424565
F  -6.855909 0.26854 0.715805
F  -6.126066 2.038988 -0.279555
O  2.203032 1.373462 0.024043
O  4.411796 1.168265 1.504107
O  -1.972616 -0.154189 1.774051
O  -2.517942 -1.581609 -2.496718
O  5.530287 2.494008 0.082578
O  3.621193 0.070299 -1.111218
N  -2.220305 -0.828984 -0.371891
N  -3.960735 0.290095 0.763533
C  3.12198 2.475368 0.019333
C  -0.8686 -1.289602 -0.381159
C  -4.752591 0.13066 -0.348652
C  -2.667749 -0.230142 0.795384
C  2.557415 3.455868 1.044151
C  3.200639 3.117604 -1.356397
C  1.489361 -0.78598 -0.473713
C  0.161326 -0.372829 -0.42392
C  -2.976087 -1.022435 -1.534137
C  -4.32239 -0.492764 -1.453778
C  4.507647 2.032154 0.501096
C  -0.591333 -2.644755 -0.370107
C  2.567287 0.235766 -0.565653
C  1.760142 -2.155833 -0.469121
C  -4.416938 0.931094 1.997063
C  0.721137 -3.073816 -0.409196
C  -6.154958 0.704684 -0.331088
C  5.62382 0.628945 2.045103
C  6.086266 -0.555585 1.263417
C  6.240799 -1.75808 1.797643
H  2.444579 2.992173 2.022993
H  3.218465 4.3164 1.141713
H  1.581276 3.81791 0.72023
H  3.658285 2.465161 -2.095551
H  2.198152 3.384162 -1.692774
H  3.790839 4.03056 -1.309807
H  -0.068361 0.683023 -0.430518
H  -4.944902 -0.613798 -2.324711
H  -1.393183 -3.369262 -0.331655
H  -4.940621 1.85674 1.784501
H  -5.057576 0.26883 2.575786
H  -3.545695 1.168214 2.594956
H  0.945852 -4.13062 -0.39418
H  5.381878 0.345113 3.069142
H  6.39469 1.402216 2.074106
H  6.313755 -0.390003 0.216648
H  6.600771 -2.593981 1.214363
H  6.011724 -1.958196 2.837513
totalener: -2093.78365106 hartree
nucrepener: 3526.20863616 hartree
electener: -5619.99228721 hartree
oneelecener: -9889.50808055 hartree
twoeener: 4269.51579334 hartree
kineticenergy: 2086.90647621 hartree
xcener: -168.851882575255 hartree
chargesum: 0.0000000
charge: -0.034807 -0.151215 -0.157441 -0.158081 -0.283077 -0.262183 -0.368306 -0.339064 -0.348055 -0.344001 -0.123326 -0.130830 0.293190 0.142711 -0.023814 0.342452 -0.294140 -0.296334 0.028168 -0.101305 0.270254 -0.155872 0.299783 -0.137987 0.381147 0.041742 -0.204772 -0.116881 0.538856 0.048894 -0.147024 -0.208869 0.115816 0.101283 0.093858 0.122354 0.094956 0.103265 0.106908 0.135060 0.117941 0.123656 0.126038 0.125318 0.115763 0.093923 0.099496 0.134626 0.106894 0.083036
qa: -0.0348 -0.1512 -0.1574 -0.1581 -0.2831 -0.2622 -0.3683 -0.3391 -0.3481 -0.3440 -0.1233 -0.1308 0.2932 0.1427 -0.0238 0.3425 -0.2941 -0.2963 0.0282 -0.1013 0.2703 -0.1559 0.2998 -0.1380 0.3811 0.0417 -0.2048 -0.1169 0.5389 0.0489 -0.1470 -0.2089 0.1158 0.1013 0.0939 0.1224 0.0950 0.1033 0.1069 0.1351 0.1179 0.1237 0.1260 0.1253 0.1158 0.0939 0.0995 0.1346 0.1069 0.0830
va: 1.2849 1.1611 1.1524 1.1489 2.1424 2.1422 2.1433 2.1709 2.1643 2.1410 3.1118 3.3041 3.8489 3.7262 3.9667 4.2732 3.9235 3.9454 3.7237 4.1552 4.2826 3.8279 4.2422 4.1532 4.1696 4.0385 3.8563 4.0493 4.4133 3.8958 3.8144 3.9651 1.0156 1.0071 1.0065 1.0167 1.0048 1.0134 1.0422 1.0243 1.0128 1.0038 0.9912 1.0224 1.0213 1.0025 1.0126 1.0126 1.0085 1.0175
dispcorr: -0.028024315 hartree
energy: -2093.811675372385
dipole: 40.76882 -42.64593 -1.87711 14.00544 -13.57066 0.43478 12.67132 -11.35901 1.31230
magnitude: 2.33125 au
magnitude: 5.92557 debye
