program: Orca
programVersion: 5.0.2
elementType: Cl F F F O O O O O O N N C C C C C C C C C C C C C C C C C C C C H H H H H H H H H H H H H H H H H H
charge: 0
multiplicity: 1
keywords: wb97x-d3
keywords: def2-TZVPP
keywords: def2/J RIJCOSX
keywords: DEFGRID2
keywords: scfconv7
keywords: smallprint printgap noloewdin
keywords: NOSOSCF
formula: C20H18ClF3N2O6
InChI: InChI=1/C20H18ClF3N2O6/c1-5-8-31-17(29)19(2,3)32-16(28)12-9-11(6-7-13(12)21)26-15(27)10-14(20(22,23)24)25(4)18(26)30/h5-7,9-10H,1,8H2,2-4H3
50 atoms
Cl 3.334943 -2.852629 -0.321853
F  -6.800045 0.373617 -1.511835
F  -6.869487 0.267746 0.627332
F  -6.132561 2.046398 -0.348926
O  2.222013 1.357259 -0.065644
O  4.36837 1.271363 1.518681
O  -2.00507 -0.127726 1.777928
O  -2.4641 -1.556848 -2.501579
O  5.555526 2.452357 0.027509
O  3.674155 -0.045185 -1.023887
N  -2.213208 -0.809083 -0.369897
N  -3.976445 0.30799 0.730813
C  3.150653 2.449558 -0.12604
C  -0.86781 -1.287764 -0.345625
C  -4.746105 0.146517 -0.396666
C  -2.68229 -0.207498 0.787016
C  2.554375 3.516581 0.788143
C  3.289541 2.972325 -1.547153
C  1.499817 -0.826565 -0.428293
C  0.17727 -0.39068 -0.415551
C  -2.943701 -1.000058 -1.548193
C  -4.292094 -0.472587 -1.49474
C  4.512134 2.03928 0.445834
C  -0.613707 -2.645427 -0.272762
C  2.596499 0.172932 -0.547089
C  1.746641 -2.199633 -0.358677
C  -4.459107 0.942648 1.957434
C  0.691283 -3.097224 -0.274863
C  -6.151798 0.711948 -0.404714
C  5.553379 0.760341 2.140432
C  6.022726 -0.484139 1.462648
C  6.129682 -1.649998 2.082776
H  2.393975 3.13717 1.796245
H  3.220957 4.376654 0.843109
H  1.597787 3.859656 0.392981
H  3.764094 2.253718 -2.210586
H  2.304418 3.221766 -1.942886
H  3.891941 3.87864 -1.555406
H  -0.036014 0.667016 -0.472031
H  -4.897739 -0.594328 -2.377487
H  -1.428743 -3.353833 -0.214299
H  -5.094493 0.269473 2.529689
H  -3.600051 1.197172 2.565698
H  -4.997422 1.858044 1.737607
H  0.898021 -4.155897 -0.21165
H  5.272037 0.555784 3.173132
H  6.333846 1.52442 2.139663
H  6.293707 -0.39651 0.416737
H  6.495123 -2.529789 1.571543
H  5.859279 -1.77413 3.124478
totalener: -2093.78369428 hartree
nucrepener: 3524.90756608 hartree
electener: -5618.69126036 hartree
oneelecener: -9886.91360075 hartree
twoeener: 4268.22234039 hartree
kineticenergy: 2086.90368916 hartree
xcener: -168.851182049721 hartree
chargesum: 0.0000000
charge: -0.033247 -0.151230 -0.157317 -0.158221 -0.283470 -0.262418 -0.368512 -0.338749 -0.348029 -0.345915 -0.123508 -0.131323 0.293022 0.142628 -0.024526 0.343949 -0.294841 -0.297185 0.023478 -0.102105 0.271063 -0.156065 0.300415 -0.138789 0.385889 0.043045 -0.203475 -0.115017 0.538664 0.048213 -0.147874 -0.206297 0.115914 0.101628 0.093763 0.122365 0.095644 0.103575 0.106977 0.135127 0.116753 0.125915 0.125188 0.122896 0.115390 0.094056 0.099650 0.134247 0.105319 0.083341
qa: -0.0332 -0.1512 -0.1573 -0.1582 -0.2835 -0.2624 -0.3685 -0.3387 -0.3480 -0.3459 -0.1235 -0.1313 0.2930 0.1426 -0.0245 0.3439 -0.2948 -0.2972 0.0235 -0.1021 0.2711 -0.1561 0.3004 -0.1388 0.3859 0.0430 -0.2035 -0.1150 0.5387 0.0482 -0.1479 -0.2063 0.1159 0.1016 0.0938 0.1224 0.0956 0.1036 0.1070 0.1351 0.1168 0.1259 0.1252 0.1229 0.1154 0.0941 0.0997 0.1342 0.1053 0.0833
va: 1.2860 1.1610 1.1527 1.1487 2.1421 2.1415 2.1428 2.1706 2.1640 2.1378 3.1034 3.3053 3.8482 3.7137 3.9673 4.2739 3.9237 3.9456 3.7284 4.1660 4.2832 3.8277 4.2409 4.1601 4.1693 4.0407 3.8580 4.0475 4.4134 3.8961 3.8163 3.9660 1.0155 1.0072 1.0061 1.0166 1.0049 1.0132 1.0428 1.0244 1.0131 0.9910 1.0218 1.0044 1.0219 1.0024 1.0123 1.0132 1.0091 1.0172
dispcorr: -0.027971024 hartree
energy: -2093.811665304596
dipole: 40.53959 -42.46353 -1.92395 14.40586 -13.91385 0.49201 12.30498 -11.05383 1.25116
magnitude: 2.34713 au
magnitude: 5.96594 debye
