program: Orca
programVersion: 5.0.2
elementType: Cl F F F O O O O O O N N C C C C C C C C C C C C C C C C C C C C H H H H H H H H H H H H H H H H H H
charge: 0
multiplicity: 1
keywords: wb97x-d3
keywords: def2-TZVPP
keywords: def2/J RIJCOSX
keywords: DEFGRID2
keywords: scfconv7
keywords: smallprint printgap noloewdin
keywords: NOSOSCF
formula: C20H18ClF3N2O6
InChI: InChI=1/C20H18ClF3N2O6/c1-5-8-31-17(29)19(2,3)32-16(28)12-9-11(6-7-13(12)21)26-15(27)10-14(20(22,23)24)25(4)18(26)30/h5-7,9-10H,1,8H2,2-4H3
50 atoms
Cl 3.36233 -3.884559 0.410644
F  -6.046215 0.696325 -1.923415
F  -6.201833 0.898072 0.205987
F  -5.139969 2.37903 -0.955178
O  3.054502 0.100287 -1.016882
O  2.524522 1.714079 0.934713
O  -1.481764 -0.037482 1.643968
O  -2.127433 -2.138549 -2.325295
O  4.627252 2.495524 1.025003
O  3.954841 -0.926508 0.762721
N  -1.782881 -1.071068 -0.347512
N  -3.343262 0.505999 0.457347
C  3.918263 1.240605 -0.907849
C  -0.538786 -1.751755 -0.17257
C  -4.102767 0.286608 -0.66759
C  -2.154317 -0.192554 0.657749
C  3.381695 2.235283 -1.935685
C  5.369292 0.896713 -1.204815
C  1.865843 -1.671799 -0.090392
C  0.641333 -1.046729 -0.293616
C  -2.513361 -1.341346 -1.51052
C  -3.74242 -0.58147 -1.621598
C  3.763651 1.876167 0.477124
C  -0.514817 -3.105709 0.108769
C  3.089679 -0.825089 -0.058498
C  1.883394 -3.034881 0.195786
C  -3.744168 1.406067 1.539676
C  0.697744 -3.749656 0.275748
C  -5.386538 1.071717 -0.83529
C  2.19596 2.282982 2.207292
C  1.802141 3.716301 2.063617
C  2.464352 4.718954 2.621212
H  2.334285 2.475929 -1.755921
H  3.957338 3.159002 -1.897979
H  3.471464 1.821487 -2.940046
H  5.807525 0.250302 -0.449746
H  5.434755 0.400608 -2.1735
H  5.963178 1.80759 -1.253928
H  0.6152 0.01023 -0.517524
H  -4.339147 -0.746131 -2.503515
H  -1.436607 -3.664418 0.19508
H  -4.531674 0.966283 2.148137
H  -2.8813 1.575012 2.171494
H  -4.070711 2.364887 1.151607
H  0.725379 -4.810553 0.479274
H  3.025816 2.166969 2.905611
H  1.357676 1.682679 2.563091
H  0.914549 3.914389 1.471057
H  2.139092 5.744333 2.510172
H  3.362795 4.552992 3.201291
totalener: -2093.78300524 hartree
nucrepener: 3572.67663255 hartree
electener: -5666.45963779 hartree
oneelecener: -9982.13529459 hartree
twoeener: 4315.67565680 hartree
kineticenergy: 2086.91470254 hartree
xcener: -168.851031001677 hartree
chargesum: 0.0000000
charge: -0.034261 -0.151039 -0.157136 -0.158774 -0.284396 -0.274791 -0.382114 -0.338213 -0.337625 -0.330938 -0.122137 -0.128653 0.288230 0.170167 -0.027121 0.350467 -0.287379 -0.286212 0.078162 -0.134306 0.271944 -0.153791 0.301910 -0.152786 0.328469 0.027818 -0.209578 -0.104774 0.540425 0.056079 -0.184699 -0.164844 0.101948 0.106342 0.103091 0.122106 0.097573 0.098926 0.102348 0.135369 0.116630 0.128016 0.124046 0.126045 0.116262 0.102205 0.105853 0.106236 0.103040 0.095855
qa: -0.0343 -0.1510 -0.1571 -0.1588 -0.2844 -0.2748 -0.3821 -0.3382 -0.3376 -0.3309 -0.1221 -0.1287 0.2882 0.1702 -0.0271 0.3505 -0.2874 -0.2862 0.0782 -0.1343 0.2719 -0.1538 0.3019 -0.1528 0.3285 0.0278 -0.2096 -0.1048 0.5404 0.0561 -0.1847 -0.1648 0.1019 0.1063 0.1031 0.1221 0.0976 0.0989 0.1023 0.1354 0.1166 0.1280 0.1240 0.1260 0.1163 0.1022 0.1059 0.1062 0.1030 0.0959
va: 1.2870 1.1620 1.1517 1.1489 2.1437 2.1112 2.1213 2.1723 2.1817 2.1528 3.1116 3.3017 3.8512 3.6858 3.9676 4.2566 3.9244 3.9354 3.6721 4.1679 4.2824 3.8276 4.2329 4.1609 4.2478 4.0450 3.8527 4.0235 4.4101 3.8715 3.8592 3.9613 1.0115 1.0091 1.0075 1.0206 1.0056 1.0138 1.0470 1.0241 1.0138 0.9914 1.0241 1.0027 1.0193 1.0152 1.0002 1.0095 1.0061 1.0159
dispcorr: -0.028166364 hartree
energy: -2093.811171603624
dipole: 31.99352 -33.94377 -1.95025 23.69504 -22.65211 1.04293 6.99209 -6.99983 -0.00774
magnitude: 2.21161 au
magnitude: 5.62148 debye
