program: Orca
programVersion: 5.0.2
elementType: Cl F F F O O O O O O N N C C C C C C C C C C C C C C C C C C C C H H H H H H H H H H H H H H H H H H
charge: 0
multiplicity: 1
keywords: wb97x-d3
keywords: def2-TZVPP
keywords: def2/J RIJCOSX
keywords: DEFGRID2
keywords: scfconv7
keywords: smallprint printgap noloewdin
keywords: NOSOSCF
formula: C20H18ClF3N2O6
InChI: InChI=1/C20H18ClF3N2O6/c1-5-8-31-17(29)19(2,3)32-16(28)12-9-11(6-7-13(12)21)26-15(27)10-14(20(22,23)24)25(4)18(26)30/h5-7,9-10H,1,8H2,2-4H3
50 atoms
Cl 3.38673 -3.940927 0.389951
F  -5.973494 0.79008 -1.881153
F  -6.071753 1.061292 0.242796
F  -4.988605 2.468777 -0.985972
O  3.105758 0.061861 -1.019869
O  2.395757 1.607021 0.916644
O  -1.372121 -0.021504 1.618809
O  -2.142824 -2.161826 -2.308759
O  4.433324 2.527321 1.116096
O  3.985238 -0.978374 0.763293
N  -1.732633 -1.076241 -0.353222
N  -3.22465 0.570613 0.443746
C  3.909197 1.238859 -0.854546
C  -0.498435 -1.77801 -0.192483
C  -4.014603 0.350993 -0.659834
C  -2.060756 -0.168997 0.64203
C  3.383588 2.216898 -1.903434
C  5.390131 0.971522 -1.072106
C  1.907901 -1.718892 -0.118316
C  0.688015 -1.085918 -0.323234
C  -2.49188 -1.342781 -1.49898
C  -3.701158 -0.550222 -1.600024
C  3.64242 1.85478 0.522831
C  -0.485879 -3.131516 0.092425
C  3.131882 -0.873226 -0.069306
C  1.9143 -3.081103 0.171701
C  -3.566091 1.515083 1.508354
C  0.722505 -3.785369 0.254787
C  -5.275695 1.174734 -0.820912
C  1.957423 2.158196 2.164322
C  1.488257 3.564383 1.985053
C  2.076946 4.610408 2.545754
H  3.911988 3.166163 -1.827899
H  3.548829 1.816192 -2.903621
H  2.317474 2.406436 -1.781654
H  5.822236 0.351583 -0.292231
H  5.531834 0.476382 -2.033206
H  5.93599 1.912975 -1.096941
H  0.670085 -0.030116 -0.551477
H  -4.321366 -0.716561 -2.465259
H  -1.411338 -3.682683 0.186869
H  -4.328755 1.108525 2.16885
H  -2.67406 1.699016 2.093737
H  -3.90041 2.461434 1.099064
H  0.741713 -4.846044 0.460641
H  2.751026 2.097252 2.910073
H  1.138119 1.508598 2.473622
H  0.612611 3.70498 1.359116
H  1.701577 5.615129 2.407628
H  2.961814 4.500562 3.159253
totalener: -2093.78222267 hartree
nucrepener: 3593.38705598 hartree
electener: -5687.16927865 hartree
twoeener: 4336.31665237 hartree
kineticenergy: 2086.91478144 hartree
xcener: -168.851093324531 hartree
chargesum: -0.0000000
charge: -0.034300 -0.150729 -0.156811 -0.158876 -0.287710 -0.275412 -0.387163 -0.338322 -0.338218 -0.328766 -0.122003 -0.128330 0.289643 0.184088 -0.026377 0.352392 -0.286664 -0.282181 0.080423 -0.149870 0.272694 -0.154478 0.297860 -0.157525 0.330500 0.024936 -0.207468 -0.100678 0.539893 0.053716 -0.186442 -0.164270 0.106368 0.103481 0.101168 0.122313 0.097153 0.098173 0.103556 0.135433 0.117251 0.128631 0.122831 0.125624 0.116260 0.105747 0.108038 0.104777 0.103406 0.096238
qa: -0.0343 -0.1507 -0.1568 -0.1589 -0.2877 -0.2754 -0.3872 -0.3383 -0.3382 -0.3288 -0.1220 -0.1283 0.2896 0.1841 -0.0264 0.3524 -0.2867 -0.2822 0.0804 -0.1499 0.2727 -0.1545 0.2979 -0.1575 0.3305 0.0249 -0.2075 -0.1007 0.5399 0.0537 -0.1864 -0.1643 0.1064 0.1035 0.1012 0.1223 0.0972 0.0982 0.1036 0.1354 0.1173 0.1286 0.1228 0.1256 0.1163 0.1057 0.1080 0.1048 0.1034 0.0962
va: 1.2868 1.1623 1.1527 1.1484 2.1399 2.1058 2.1133 2.1727 2.1818 2.1564 3.1181 3.3027 3.8509 3.6691 3.9647 4.2513 3.9252 3.9333 3.6591 4.1699 4.2814 3.8279 4.2381 4.1635 4.2558 4.0477 3.8578 4.0160 4.4123 3.8584 3.8565 3.9627 1.0094 1.0075 1.0111 1.0210 1.0058 1.0138 1.0480 1.0240 1.0139 0.9914 1.0210 1.0038 1.0190 1.0157 1.0027 1.0094 1.0060 1.0165
dispcorr: -0.028785893 hartree
energy: -2093.811008566579
dipole: 30.74383 -32.67499 -1.93116 23.35891 -22.29232 1.06660 7.03206 -7.06061 -0.02855
magnitude: 2.20631 au
magnitude: 5.60800 debye
