program: Orca
programVersion: 5.0.2
elementType: Cl F F F O O O O O O N N C C C C C C C C C C C C C C C C C C C C H H H H H H H H H H H H H H H H H H
charge: 0
multiplicity: 1
keywords: wb97x-d3
keywords: def2-TZVPP
keywords: def2/J RIJCOSX
keywords: DEFGRID2
keywords: scfconv7
keywords: smallprint printgap noloewdin
keywords: NOSOSCF
formula: C20H18ClF3N2O6
InChI: InChI=1/C20H18ClF3N2O6/c1-5-8-31-17(29)19(2,3)32-16(28)12-9-11(6-7-13(12)21)26-15(27)10-14(20(22,23)24)25(4)18(26)30/h5-7,9-10H,1,8H2,2-4H3
50 atoms
Cl 3.461321 -3.727898 0.148588
F  -5.526661 1.956781 0.615494
F  -5.278537 2.193359 -1.495676
F  -6.382445 0.514411 -0.744513
O  3.415044 0.003897 -0.750326
O  2.708465 2.139547 0.580609
O  -2.387648 -1.753429 1.663932
O  -1.075571 -0.050801 -2.3359
O  4.826322 2.606833 1.139705
O  3.667491 -0.611296 1.393525
N  -1.726291 -0.930101 -0.339919
N  -3.833449 -0.379834 0.576496
C  4.395966 1.047733 -0.655362
C  -0.481886 -1.622442 -0.216961
C  -4.040557 0.479888 -0.474997
C  -2.626806 -1.068004 0.705298
C  4.273967 1.813334 -1.971308
C  5.802664 0.496275 -0.485233
C  1.897716 -1.531015 0.090638
C  0.673566 -0.890943 -0.024276
C  -1.907003 -0.1204 -1.467566
C  -3.151049 0.622494 -1.466963
C  4.029837 2.001891 0.484651
C  -0.424226 -3.001899 -0.316066
C  3.105612 -0.689602 0.339744
C  1.948288 -2.914231 0.01481
C  -4.794499 -0.587667 1.660024
C  0.792507 -3.65025 -0.196107
C  -5.320187 1.292736 -0.521908
C  2.191585 2.952343 1.62098
C  0.736485 3.185212 1.393678
C  0.04549 2.898196 0.298978
H  4.54422 1.165129 -2.804877
H  3.259831 2.175082 -2.136021
H  4.951455 2.666336 -1.974048
H  6.528938 1.303235 -0.563165
H  5.947195 0.007688 0.4743
H  6.010554 -0.22025 -1.280189
H  0.624697 0.186593 0.054005
H  -3.315301 1.292645 -2.294349
H  -1.323664 -3.578221 -0.483449
H  -4.709733 0.183288 2.423483
H  -5.808574 -0.616347 1.277665
H  -4.585615 -1.545318 2.121776
H  0.845971 -4.727147 -0.269412
H  2.72075 3.909354 1.668091
H  2.350957 2.457692 2.584419
H  0.232431 3.656519 2.23111
H  -1.009634 3.127359 0.240286
H  0.489027 2.444891 -0.577645
totalener: -2093.78268867 hartree
nucrepener: 3608.78148100 hartree
electener: -5702.56416967 hartree
twoeener: 4351.55520960 hartree
kineticenergy: 2086.88451649 hartree
xcener: -168.846568998475 hartree
chargesum: 0.0000000
charge: -0.047698 -0.157780 -0.151830 -0.157447 -0.254223 -0.270084 -0.368620 -0.337845 -0.334188 -0.323103 -0.105005 -0.126378 0.287357 0.145876 -0.015170 0.343832 -0.288184 -0.288557 0.081103 -0.067358 0.256581 -0.172377 0.280153 -0.137023 0.280173 0.072706 -0.198765 -0.134170 0.538686 0.074757 -0.126817 -0.258161 0.102449 0.113498 0.098689 0.100073 0.121982 0.099760 0.046250 0.134165 0.115267 0.126622 0.121449 0.123021 0.117219 0.105194 0.110417 0.107641 0.100686 0.115176
qa: -0.0477 -0.1578 -0.1518 -0.1574 -0.2542 -0.2701 -0.3686 -0.3378 -0.3342 -0.3231 -0.1050 -0.1264 0.2874 0.1459 -0.0152 0.3438 -0.2882 -0.2886 0.0811 -0.0674 0.2566 -0.1724 0.2802 -0.1370 0.2802 0.0727 -0.1988 -0.1342 0.5387 0.0748 -0.1268 -0.2582 0.1024 0.1135 0.0987 0.1001 0.1220 0.0998 0.0463 0.1342 0.1153 0.1266 0.1214 0.1230 0.1172 0.1052 0.1104 0.1076 0.1007 0.1152
va: 1.2769 1.1520 1.1596 1.1495 2.1597 2.1230 2.1412 2.1664 2.1816 2.1689 3.1174 3.3016 3.8623 3.7567 3.9521 4.2728 3.9355 3.9375 3.7283 4.1393 4.2746 3.8206 4.2324 4.1102 4.2613 3.9490 3.8661 4.0627 4.4157 3.8685 3.8308 3.9606 1.0073 1.0094 1.0078 1.0134 1.0196 1.0055 1.0595 1.0258 1.0141 0.9909 1.0059 1.0177 1.0173 1.0048 0.9967 1.0101 1.0142 1.0130
dispcorr: -0.030133332 hartree
energy: -2093.812822001537
dipole: 28.05567 -29.96694 -1.91128 13.79237 -13.42413 0.36824 2.21964 -2.55923 -0.33958
magnitude: 1.97583 au
magnitude: 5.02215 debye
