program: Orca
programVersion: 5.0.2
elementType: Cl F F F O O O O O O N N C C C C C C C C C C C C C C C C C C C C H H H H H H H H H H H H H H H H H H
charge: 0
multiplicity: 1
keywords: wb97x-d3
keywords: def2-TZVPP
keywords: def2/J RIJCOSX
keywords: DEFGRID2
keywords: scfconv7
keywords: smallprint printgap noloewdin
keywords: NOSOSCF
formula: C20H18ClF3N2O6
InChI: InChI=1/C20H18ClF3N2O6/c1-5-8-31-17(29)19(2,3)32-16(28)12-9-11(6-7-13(12)21)26-15(27)10-14(20(22,23)24)25(4)18(26)30/h5-7,9-10H,1,8H2,2-4H3
50 atoms
Cl 3.422651 -3.301905 -0.409178
F  -6.71978 -0.240064 -0.003444
F  -6.023137 1.657283 0.759004
F  -6.182981 1.334976 -1.354422
O  3.913251 -0.432504 -0.053935
O  3.569606 2.136785 -0.533009
O  -2.164451 -1.446974 1.841142
O  -1.690511 -0.11225 -2.463272
O  4.956693 2.699073 1.136914
O  2.637895 0.366616 1.599856
N  -1.94161 -0.814648 -0.316648
N  -3.925622 -0.371898 0.878933
C  4.999838 0.444528 0.278134
C  -0.637495 -1.396069 -0.336434
C  -4.431904 0.232096 -0.246868
C  -2.642188 -0.916442 0.87382
C  5.948885 0.351382 -0.913009
C  5.693046 0.006877 1.558476
C  1.719799 -1.233547 0.122799
C  0.438861 -0.692762 0.160489
C  -2.38432 -0.181215 -1.481849
C  -3.73075 0.346071 -1.383065
C  4.499085 1.888807 0.383208
C  -0.459724 -2.663345 -0.8611
C  2.801887 -0.362441 0.659181
C  1.88994 -2.514009 -0.398734
C  -4.623795 -0.398825 2.164704
C  0.802176 -3.225641 -0.882568
C  -5.852556 0.754472 -0.208099
C  2.94439 3.424306 -0.526175
C  1.853719 3.491925 0.492335
C  0.578391 3.671628 0.177043
H  6.334838 -0.663848 -1.004093
H  5.45032 0.613846 -1.845023
H  6.794647 1.022983 -0.770192
H  5.984557 -1.040182 1.47448
H  6.594637 0.596332 1.71402
H  5.062267 0.127348 2.43546
H  0.299018 0.297954 0.572814
H  -4.137293 0.813576 -2.264446
H  -1.304591 -3.217103 -1.24748
H  -4.114366 -1.106088 2.807056
H  -4.601131 0.577582 2.644934
H  -5.650643 -0.728534 2.050406
H  0.946769 -4.222334 -1.273979
H  2.543076 3.55258 -1.530995
H  3.690053 4.202647 -0.3493
H  2.150689 3.399952 1.530771
H  -0.186364 3.743822 0.938265
H  0.248878 3.762466 -0.850985
totalener: -2093.78454462 hartree
nucrepener: 3560.50521411 hartree
electener: -5654.28975873 hartree
oneelecener: -9958.01422101 hartree
twoeener: 4303.72446227 hartree
kineticenergy: 2086.91979329 hartree
xcener: -168.852301798079 hartree
chargesum: -0.0000000
charge: -0.051021 -0.158496 -0.157134 -0.151891 -0.270424 -0.261934 -0.366206 -0.341490 -0.346597 -0.358265 -0.117535 -0.131373 0.294669 0.136408 -0.026546 0.347038 -0.290759 -0.295256 0.053694 -0.103780 0.277097 -0.158703 0.292354 -0.144986 0.372115 0.047959 -0.207382 -0.113322 0.539540 0.047432 -0.154420 -0.222959 0.099992 0.113257 0.098829 0.099846 0.102083 0.120181 0.108169 0.133929 0.112477 0.128323 0.126091 0.123103 0.115821 0.097553 0.101765 0.138647 0.108548 0.093558
qa: -0.0510 -0.1585 -0.1571 -0.1519 -0.2704 -0.2619 -0.3662 -0.3415 -0.3466 -0.3583 -0.1175 -0.1314 0.2947 0.1364 -0.0265 0.3470 -0.2908 -0.2953 0.0537 -0.1038 0.2771 -0.1587 0.2924 -0.1450 0.3721 0.0480 -0.2074 -0.1133 0.5395 0.0474 -0.1544 -0.2230 0.1000 0.1133 0.0988 0.0998 0.1021 0.1202 0.1082 0.1339 0.1125 0.1283 0.1261 0.1231 0.1158 0.0976 0.1018 0.1386 0.1085 0.0936
va: 1.2661 1.1496 1.1526 1.1600 2.1633 2.1353 2.1460 2.1674 2.1657 2.1421 3.0757 3.3064 3.8507 3.6813 3.9692 4.2733 3.9265 3.9420 3.7240 4.1805 4.2810 3.8306 4.2455 4.1717 4.1735 3.9897 3.8528 4.0421 4.4126 3.8969 3.8144 3.9541 1.0073 1.0157 1.0076 1.0065 1.0131 1.0177 1.0386 1.0249 1.0158 1.0239 0.9907 1.0038 1.0191 1.0022 1.0111 1.0114 1.0070 1.0151
dispcorr: -0.028622207 hartree
energy: -2093.813166826397
dipole: 37.60839 -38.83978 -1.23139 13.08907 -13.32121 -0.23214 5.65831 -6.03663 -0.37832
magnitude: 1.30894 au
magnitude: 3.32707 debye
