program: Orca
programVersion: 5.0.2
elementType: Cl F F F O O O O O O N N C C C C C C C C C C C C C C C C C C C C H H H H H H H H H H H H H H H H H H
charge: 0
multiplicity: 1
keywords: wb97x-d3
keywords: def2-TZVPP
keywords: def2/J RIJCOSX
keywords: DEFGRID2
keywords: scfconv7
keywords: smallprint printgap noloewdin
keywords: NOSOSCF
formula: C20H18ClF3N2O6
InChI: InChI=1/C20H18ClF3N2O6/c1-5-8-31-17(29)19(2,3)32-16(28)12-9-11(6-7-13(12)21)26-15(27)10-14(20(22,23)24)25(4)18(26)30/h5-7,9-10H,1,8H2,2-4H3
50 atoms
Cl 3.406107 -3.596886 0.487404
F  -5.293577 2.484721 -0.69853
F  -5.854444 1.044045 -2.182971
F  -6.360524 0.6943 -0.130281
O  3.149826 0.295171 -1.05392
O  2.896402 2.079658 0.806819
O  -1.857083 -0.321276 1.847339
O  -1.666806 -1.364892 -2.56039
O  5.078832 2.584031 0.784626
O  3.999539 -0.628675 0.804287
N  -1.739155 -0.811205 -0.357455
N  -3.542004 0.432022 0.517065
C  4.125437 1.35015 -1.063255
C  -0.491901 -1.474207 -0.13994
C  -4.097197 0.457201 -0.740964
C  -2.343273 -0.240596 0.748947
C  3.635041 2.330622 -2.124984
C  5.511824 0.832282 -1.412287
C  1.909703 -1.388995 -0.032855
C  0.686096 -0.762993 -0.241995
C  -2.249651 -0.818701 -1.660505
C  -3.512913 -0.122371 -1.797826
C  4.120771 2.062413 0.293686
C  -0.46791 -2.827772 0.142442
C  3.146547 -0.559888 -0.034323
C  1.926313 -2.749849 0.260551
C  -4.187318 1.009114 1.696604
C  0.741983 -3.468013 0.334205
C  -5.415218 1.176693 -0.938259
C  2.748211 2.4484 2.185251
C  1.376984 2.018051 2.585098
C  1.141874 0.954797 3.340235
H  4.306324 3.186749 -2.179101
H  3.622715 1.849225 -3.102932
H  2.630674 2.692867 -1.908473
H  5.473129 0.297764 -2.36176
H  6.20174 1.666593 -1.524038
H  5.912241 0.168129 -0.65118
H  0.658719 0.294931 -0.462891
H  -3.950665 -0.095973 -2.781865
H  -1.391331 -3.387092 0.208352
H  -4.558509 2.007063 1.490536
H  -5.000186 0.379396 2.052859
H  -3.446318 1.083361 2.482842
H  0.770559 -4.527808 0.543175
H  2.890706 3.52616 2.295648
H  3.508809 1.944227 2.784843
H  0.546063 2.596224 2.194344
H  0.136182 0.635299 3.572351
H  1.949839 0.344856 3.725675
totalener: -2093.78313004 hartree
nucrepener: 3605.33789901 hartree
electener: -5699.12102905 hartree
twoeener: 4348.37852013 hartree
kineticenergy: 2086.91069150 hartree
xcener: -168.848616884979 hartree
chargesum: 0.0000000
charge: -0.035427 -0.158540 -0.151084 -0.157230 -0.273533 -0.264506 -0.390197 -0.336472 -0.335204 -0.335548 -0.116484 -0.127635 0.295079 0.168875 -0.027520 0.359636 -0.288706 -0.289907 0.099164 -0.147906 0.276452 -0.156298 0.283890 -0.149162 0.306684 0.051899 -0.209462 -0.114497 0.540184 0.061083 -0.193116 -0.163906 0.104430 0.102866 0.106551 0.098003 0.100767 0.121852 0.095600 0.134910 0.110069 0.125919 0.127268 0.123877 0.115381 0.100577 0.098713 0.106143 0.110039 0.096430
qa: -0.0354 -0.1585 -0.1511 -0.1572 -0.2735 -0.2645 -0.3902 -0.3365 -0.3352 -0.3355 -0.1165 -0.1276 0.2951 0.1689 -0.0275 0.3596 -0.2887 -0.2899 0.0992 -0.1479 0.2765 -0.1563 0.2839 -0.1492 0.3067 0.0519 -0.2095 -0.1145 0.5402 0.0611 -0.1931 -0.1639 0.1044 0.1029 0.1066 0.0980 0.1008 0.1219 0.0956 0.1349 0.1101 0.1259 0.1273 0.1239 0.1154 0.1006 0.0987 0.1061 0.1100 0.0964
va: 1.2867 1.1493 1.1613 1.1517 2.1555 2.1082 2.1134 2.1717 2.1827 2.1419 3.0704 3.3049 3.8382 3.6255 3.9690 4.2507 3.9263 3.9420 3.6417 4.1878 4.2816 3.8353 4.2478 4.1789 4.2628 4.0210 3.8597 4.0379 4.4105 3.8669 3.8740 3.9299 1.0073 1.0074 1.0116 1.0055 1.0134 1.0192 1.0478 1.0248 1.0161 1.0033 0.9912 1.0213 1.0207 0.9982 1.0077 1.0085 1.0174 1.0155
dispcorr: -0.029846001 hartree
energy: -2093.812976043446
dipole: 30.26101 -32.39140 -2.13039 14.51246 -13.94479 0.56768 8.24976 -8.23760 0.01217
magnitude: 2.20476 au
magnitude: 5.60406 debye
