program: Orca
programVersion: 5.0.2
elementType: Cl F F F O O O O O O N N C C C C C C C C C C C C C C C C C C C C H H H H H H H H H H H H H H H H H H
charge: 0
multiplicity: 1
keywords: wb97x-d3
keywords: def2-TZVPP
keywords: def2/J RIJCOSX
keywords: DEFGRID2
keywords: scfconv7
keywords: smallprint printgap noloewdin
keywords: NOSOSCF
formula: C20H18ClF3N2O6
InChI: InChI=1/C20H18ClF3N2O6/c1-5-8-31-17(29)19(2,3)32-16(28)12-9-11(6-7-13(12)21)26-15(27)10-14(20(22,23)24)25(4)18(26)30/h5-7,9-10H,1,8H2,2-4H3
50 atoms
Cl 3.218937 -3.493338 -1.216935
F  -6.657732 0.018645 0.569109
F  -5.772726 1.841448 1.319641
F  -6.129738 1.599669 -0.778396
O  2.909499 -0.220096 1.257252
O  2.800242 2.184403 0.228684
O  -2.221364 -1.902394 1.756336
O  -1.695898 0.28326 -2.182071
O  4.975822 2.56875 0.6149
O  3.832617 -0.484711 -0.771236
N  -1.949217 -0.808505 -0.204424
N  -3.864976 -0.4608 1.127146
C  3.91713 0.701356 1.69627
C  -0.698138 -1.468939 -0.404339
C  -4.367026 0.35566 0.141453
C  -2.647105 -1.117253 0.950928
C  5.277193 0.034113 1.840586
C  3.417478 1.196098 3.052093
C  1.703484 -1.439544 -0.300378
C  0.475913 -0.842357 -0.038324
C  -2.374905 0.062936 -1.212781
C  -3.6850 0.633768 -0.977714
C  3.989312 1.907917 0.757981
C  -0.665742 -2.715932 -1.002426
C  2.947879 -0.680548 0.01071
C  1.729113 -2.689596 -0.909638
C  -4.577103 -0.774425 2.366096
C  0.547248 -3.333159 -1.244415
C  -5.745654 0.958736 0.318221
C  2.732143 3.269985 -0.705483
C  3.241959 2.867536 -2.049115
C  4.230634 3.494395 -2.668306
H  5.182173 -0.853812 2.466209
H  5.705466 -0.253627 0.884616
H  5.973032 0.714594 2.327401
H  3.366237 0.365689 3.756416
H  4.104249 1.93921 3.454998
H  2.427185 1.644297 2.977794
H  0.444362 0.131695 0.431157
H  -4.080881 1.275968 -1.746559
H  -1.586817 -3.208462 -1.283326
H  -3.853086 -1.112444 3.097886
H  -5.068774 0.105434 2.765005
H  -5.306632 -1.568469 2.217849
H  0.579586 -4.311747 -1.701569
H  3.269177 4.140488 -0.324154
H  1.670293 3.515495 -0.752991
H  2.747924 2.024478 -2.519937
H  4.559496 3.195695 -3.653846
H  4.755086 4.323492 -2.210422
totalener: -2093.78331458 hartree
nucrepener: 3542.01076015 hartree
electener: -5635.79407473 hartree
oneelecener: -9920.99788628 hartree
twoeener: 4285.20381155 hartree
kineticenergy: 2086.90882849 hartree
xcener: -168.847649257942 hartree
chargesum: -0.0000000
charge: -0.038650 -0.157050 -0.158250 -0.151480 -0.270574 -0.273751 -0.368903 -0.339812 -0.338877 -0.328277 -0.119110 -0.130798 0.287617 0.137750 -0.026858 0.347912 -0.293038 -0.291973 0.090788 -0.116369 0.274401 -0.159554 0.301708 -0.141257 0.303366 0.052326 -0.203040 -0.119995 0.539775 0.034191 -0.148433 -0.171895 0.098730 0.123833 0.100709 0.102481 0.103894 0.106939 0.099811 0.134920 0.111253 0.123706 0.123132 0.126715 0.116339 0.097149 0.100389 0.116524 0.103619 0.087969
qa: -0.0387 -0.1571 -0.1583 -0.1515 -0.2706 -0.2738 -0.3689 -0.3398 -0.3389 -0.3283 -0.1191 -0.1308 0.2876 0.1377 -0.0269 0.3479 -0.2930 -0.2920 0.0908 -0.1164 0.2744 -0.1596 0.3017 -0.1413 0.3034 0.0523 -0.2030 -0.1200 0.5398 0.0342 -0.1484 -0.1719 0.0987 0.1238 0.1007 0.1025 0.1039 0.1069 0.0998 0.1349 0.1113 0.1237 0.1231 0.1267 0.1163 0.0971 0.1004 0.1165 0.1036 0.0880
va: 1.2832 1.1526 1.1489 1.1601 2.1532 2.1191 2.1408 2.1678 2.1790 2.1554 3.0745 3.3054 3.8497 3.6691 3.9719 4.2756 3.9375 3.9270 3.7017 4.1864 4.2854 3.8359 4.2247 4.1648 4.2403 4.0135 3.8673 4.0487 4.4116 3.9104 3.8400 3.9727 1.0052 1.0199 1.0141 1.0074 1.0089 1.0120 1.0448 1.0253 1.0158 1.0178 1.0055 0.9907 1.0198 1.0141 0.9940 1.0134 1.0067 1.0147
dispcorr: -0.027927630 hartree
energy: -2093.811242207689
dipole: 36.66854 -38.65687 -1.98833 13.37096 -13.23662 0.13434 9.88022 -8.76054 1.11968
magnitude: 2.28586 au
magnitude: 5.81020 debye
