program: Orca
programVersion: 5.0.2
elementType: Cl F F F O O O O O O N N C C C C C C C C C C C C C C C C C C C C H H H H H H H H H H H H H H H H H H
charge: 0
multiplicity: 1
keywords: wb97x-d3
keywords: def2-TZVPP
keywords: def2/J RIJCOSX
keywords: DEFGRID2
keywords: scfconv7
keywords: smallprint printgap noloewdin
keywords: NOSOSCF
formula: C20H18ClF3N2O6
InChI: InChI=1/C20H18ClF3N2O6/c1-5-8-31-17(29)19(2,3)32-16(28)12-9-11(6-7-13(12)21)26-15(27)10-14(20(22,23)24)25(4)18(26)30/h5-7,9-10H,1,8H2,2-4H3
50 atoms
Cl 3.397963 -3.841794 0.480307
F  -5.957104 0.763859 -1.953581
F  -6.177875 0.96692 0.169158
F  -5.059516 2.434057 -0.955038
O  3.037951 0.119563 -1.083956
O  2.686956 1.724774 0.91133
O  -1.475184 0.002558 1.713287
O  -2.070447 -2.119744 -2.25049
O  4.791052 2.495452 0.834891
O  4.048476 -0.907382 0.634431
N  -1.75267 -1.038982 -0.275777
N  -3.32199 0.543165 0.499438
C  3.922224 1.247714 -1.03839
C  -0.507708 -1.713893 -0.088477
C  -4.058486 0.328508 -0.641515
C  -2.135832 -0.154815 0.719513
C  3.321136 2.255541 -2.01653
C  5.339891 0.885402 -1.45101
C  1.899281 -1.63911 -0.072794
C  0.670318 -1.018259 -0.26605
C  -2.465873 -1.314495 -1.448068
C  -3.685951 -0.54543 -1.585822
C  3.883925 1.877135 0.357158
C  -0.480306 -3.054492 0.249935
C  3.128321 -0.802112 -0.124724
C  1.920042 -2.989545 0.270533
C  -3.746175 1.439909 1.575689
C  0.734332 -3.694409 0.415121
C  -5.326873 1.130323 -0.845328
C  2.482738 2.215631 2.242066
C  2.167756 3.674958 2.248025
C  0.983619 4.15476 2.601535
H  3.918521 3.166135 -2.028158
H  3.316881 1.841668 -3.024903
H  2.29821 2.518609 -1.748379
H  5.945559 1.786454 -1.527451
H  5.82196 0.215651 -0.744762
H  5.321894 0.408859 -2.431543
H  0.638937 0.028717 -0.532371
H  -4.264245 -0.705042 -2.480728
H  -1.401427 -3.605783 0.380852
H  -4.573197 1.015001 2.140564
H  -2.908518 1.573244 2.248708
H  -4.025922 2.414022 1.188375
H  0.764954 -4.745615 0.663585
H  3.362285 1.999985 2.851968
H  1.643919 1.636197 2.626695
H  2.966945 4.348566 1.959306
H  0.781938 5.217142 2.615593
H  0.170293 3.501729 2.894897
totalener: -2093.78383124 hartree
nucrepener: 3578.23592651 hartree
electener: -5672.01975776 hartree
oneelecener: -9993.14147310 hartree
twoeener: 4321.12171534 hartree
kineticenergy: 2086.91294303 hartree
xcener: -168.850881704446 hartree
chargesum: -0.0000000
charge: -0.032096 -0.151123 -0.157847 -0.158245 -0.286552 -0.266860 -0.381953 -0.338197 -0.347190 -0.333415 -0.121384 -0.127699 0.297876 0.162063 -0.026963 0.352273 -0.289014 -0.285485 0.071810 -0.126744 0.271632 -0.152345 0.293177 -0.152227 0.329322 0.030158 -0.210433 -0.103140 0.540709 0.052937 -0.172699 -0.197300 0.105562 0.103159 0.105861 0.099857 0.121801 0.097504 0.104366 0.135065 0.115658 0.127722 0.122635 0.127163 0.115904 0.106101 0.099101 0.136475 0.105752 0.087266
qa: -0.0321 -0.1511 -0.1578 -0.1582 -0.2866 -0.2669 -0.3820 -0.3382 -0.3472 -0.3334 -0.1214 -0.1277 0.2979 0.1621 -0.0270 0.3523 -0.2890 -0.2855 0.0718 -0.1267 0.2716 -0.1523 0.2932 -0.1522 0.3293 0.0302 -0.2104 -0.1031 0.5407 0.0529 -0.1727 -0.1973 0.1056 0.1032 0.1059 0.0999 0.1218 0.0975 0.1044 0.1351 0.1157 0.1277 0.1226 0.1272 0.1159 0.1061 0.0991 0.1365 0.1058 0.0873
va: 1.2893 1.1618 1.1508 1.1497 2.1434 2.1109 2.1240 2.1715 2.1682 2.1469 3.1012 3.3018 3.8515 3.6839 3.9692 4.2578 3.9226 3.9361 3.6721 4.1710 4.2827 3.8291 4.2280 4.1661 4.2444 4.0484 3.8538 4.0224 4.4093 3.8833 3.8427 3.9634 1.0091 1.0072 1.0111 1.0138 1.0204 1.0055 1.0459 1.0243 1.0142 0.9920 1.0250 1.0017 1.0200 1.0107 1.0045 1.0096 1.0084 1.0165
dispcorr: -0.028063285 hartree
energy: -2093.811894526154
dipole: 29.63907 -31.66243 -2.02336 22.33557 -21.38331 0.95225 6.68428 -6.64228 0.04200
magnitude: 2.23663 au
magnitude: 5.68507 debye
