program: Orca
programVersion: 5.0.2
elementType: Cl F F F O O O O O O N N C C C C C C C C C C C C C C C C C C C C H H H H H H H H H H H H H H H H H H
charge: 0
multiplicity: 1
keywords: wb97x-d3
keywords: def2-TZVPP
keywords: def2/J RIJCOSX
keywords: DEFGRID2
keywords: scfconv7
keywords: smallprint printgap noloewdin
keywords: NOSOSCF
formula: C20H18ClF3N2O6
InChI: InChI=1/C20H18ClF3N2O6/c1-5-8-31-17(29)19(2,3)32-16(28)12-9-11(6-7-13(12)21)26-15(27)10-14(20(22,23)24)25(4)18(26)30/h5-7,9-10H,1,8H2,2-4H3
50 atoms
Cl 3.516178 -3.544701 -1.275843
F  -6.315584 0.470554 0.509338
F  -5.131227 1.719403 1.814907
F  -5.400238 2.256528 -0.241525
O  3.061486 -0.246583 1.2934
O  2.765151 1.9705 0.001674
O  -1.956504 -2.085765 1.569944
O  -1.415299 0.319359 -2.234629
O  4.873578 2.628281 0.38035
O  4.138303 -0.615372 -0.639339
N  -1.675977 -0.881287 -0.323087
N  -3.575549 -0.577451 1.042233
C  3.946236 0.815568 1.679743
C  -0.424436 -1.536283 -0.540862
C  -3.972748 0.445275 0.214169
C  -2.370723 -1.242056 0.819957
C  5.351998 0.317879 1.976449
C  3.310498 1.412825 2.933336
C  1.971049 -1.532215 -0.309356
C  0.732608 -0.944999 -0.076343
C  -2.068048 0.089607 -1.247751
C  -3.289255 0.782676 -0.888422
C  3.950686 1.898102 0.595792
C  -0.368145 -2.739228 -1.220334
C  3.193186 -0.775301 0.078435
C  2.021901 -2.742483 -0.995816
C  -4.322413 -1.000549 2.227551
C  0.854577 -3.348663 -1.436514
C  -5.218573 1.229062 0.5778
C  2.603552 2.880084 -1.092265
C  1.303037 2.547109 -1.739867
C  0.309316 3.41099 -1.889427
H  5.305926 -0.483542 2.713952
H  5.860791 -0.048676 1.089824
H  5.948432 1.125726 2.39629
H  3.287052 0.670467 3.731226
H  3.896514 2.262909 3.280382
H  2.290884 1.749063 2.747459
H  0.678775 -0.000838 0.447874
H  -3.605761 1.582833 -1.537003
H  -1.274804 -3.205673 -1.581044
H  -3.989257 -1.99492 2.49949
H  -4.14132 -0.338358 3.071916
H  -5.385211 -1.048518 2.01868
H  0.907089 -4.295096 -1.955576
H  3.434211 2.756085 -1.79206
H  2.621057 3.910935 -0.729873
H  1.19425 1.536017 -2.118805
H  -0.604841 3.125256 -2.390405
H  0.374126 4.430026 -1.526958
totalener: -2093.78477237 hartree
nucrepener: 3611.72343046 hartree
electener: -5705.50820283 hartree
twoeener: 4354.62891373 hartree
kineticenergy: 2086.89878276 hartree
xcener: -168.846593577481 hartree
chargesum: 0.0000000
charge: -0.033999 -0.158329 -0.156953 -0.151321 -0.278034 -0.266697 -0.368102 -0.360470 -0.336045 -0.329061 -0.111113 -0.127987 0.295835 0.175775 -0.025963 0.347267 -0.284650 -0.290889 0.113057 -0.181972 0.289041 -0.157879 0.283702 -0.152984 0.302914 0.043965 -0.208471 -0.107169 0.541859 0.071193 -0.174345 -0.210420 0.097636 0.122200 0.099738 0.102237 0.105655 0.107187 0.105571 0.132774 0.110621 0.123278 0.127897 0.126505 0.115431 0.104828 0.089658 0.136859 0.111443 0.088727
qa: -0.0340 -0.1583 -0.1570 -0.1513 -0.2780 -0.2667 -0.3681 -0.3605 -0.3360 -0.3291 -0.1111 -0.1280 0.2958 0.1758 -0.0260 0.3473 -0.2847 -0.2909 0.1131 -0.1820 0.2890 -0.1579 0.2837 -0.1530 0.3029 0.0440 -0.2085 -0.1072 0.5419 0.0712 -0.1743 -0.2104 0.0976 0.1222 0.0997 0.1022 0.1057 0.1072 0.1056 0.1328 0.1106 0.1233 0.1279 0.1265 0.1154 0.1048 0.0897 0.1369 0.1114 0.0887
va: 1.2880 1.1494 1.1520 1.1613 2.1477 2.1114 2.1409 2.1404 2.1832 2.1524 3.0815 3.3063 3.8482 3.6247 3.9828 4.2737 3.9363 3.9280 3.6235 4.1716 4.2532 3.8552 4.2381 4.1886 4.2740 4.0385 3.8612 4.0286 4.4090 3.8708 3.8618 3.9650 1.0055 1.0204 1.0136 1.0072 1.0081 1.0107 1.0478 1.0247 1.0161 1.0206 0.9909 1.0039 1.0201 1.0007 1.0056 1.0083 1.0175 1.0150
dispcorr: -0.029881961 hartree
energy: -2093.814654334453
dipole: 26.20249 -28.47221 -2.26972 12.17309 -12.14947 0.02362 9.06181 -8.00739 1.05442
magnitude: 2.50279 au
magnitude: 6.36160 debye
