program: Orca
programVersion: 5.0.2
elementType: Cl F F F O O O O O O N N C C C C C C C C C C C C C C C C C C C C H H H H H H H H H H H H H H H H H H
charge: 0
multiplicity: 1
keywords: wb97x-d3
keywords: def2-TZVPP
keywords: def2/J RIJCOSX
keywords: DEFGRID2
keywords: scfconv7
keywords: smallprint printgap noloewdin
keywords: NOSOSCF
formula: C20H18ClF3N2O6
InChI: InChI=1/C20H18ClF3N2O6/c1-5-8-31-17(29)19(2,3)32-16(28)12-9-11(6-7-13(12)21)26-15(27)10-14(20(22,23)24)25(4)18(26)30/h5-7,9-10H,1,8H2,2-4H3
50 atoms
Cl 3.356278 -3.014831 -1.533383
F  -6.721163 -0.25627 0.837814
F  -5.778826 1.572197 1.496333
F  -6.358403 1.328134 -0.553875
O  2.579411 0.187252 1.247663
O  3.16578 2.496843 0.073872
O  -2.068105 -1.968815 1.636017
O  -2.002268 0.191415 -2.348219
O  5.22103 2.519436 0.967643
O  3.891239 -0.307832 -0.49683
N  -2.021037 -0.869562 -0.339662
N  -3.862128 -0.666572 1.119577
C  3.586204 1.003368 1.862808
C  -0.716823 -1.391599 -0.598581
C  -4.482442 0.121842 0.179467
C  -2.611166 -1.22635 0.861043
C  4.720526 0.151794 2.413621
C  2.858978 1.726632 2.994361
C  1.676589 -1.185332 -0.397325
C  0.391951 -0.728564 -0.11591
C  -2.588874 -0.057593 -1.32713
C  -3.912376 0.428148 -0.994021
C  4.116468 2.065279 0.895893
C  -0.567578 -2.537999 -1.357205
C  2.849571 -0.405027 0.086511
C  1.81807 -2.340283 -1.16773
C  -4.473034 -1.0413 2.395168
C  0.698791 -3.015012 -1.634027
C  -5.850299 0.692679 0.49389
C  3.541988 3.471182 -0.906249
C  4.298206 2.854465 -2.03586
C  5.492131 3.274233 -2.425375
H  4.315419 -0.61095 3.07919
H  5.295067 -0.333736 1.629001
H  5.40473 0.77175 2.989323
H  2.475096 1.004965 3.715644
H  3.547596 2.390725 3.515071
H  2.023815 2.319434 2.622533
H  0.260655 0.167937 0.473465
H  -4.401712 1.04972 -1.725263
H  -1.436254 -3.060532 -1.734112
H  -5.201233 -1.839934 2.268021
H  -3.689445 -1.398882 3.051879
H  -4.943159 -0.186857 2.869038
H  0.825103 -3.914772 -2.218926
H  4.113389 4.280546 -0.447334
H  2.592143 3.878453 -1.255634
H  3.811173 2.033935 -2.551416
H  6.002031 2.826328 -3.266787
H  6.011223 4.073031 -1.910871
totalener: -2093.78370889 hartree
nucrepener: 3520.90920649 hartree
electener: -5614.69291538 hartree
oneelecener: -9878.91081782 hartree
twoeener: 4264.21790244 hartree
kineticenergy: 2086.90896062 hartree
xcener: -168.850074324443 hartree
chargesum: -0.0000000
charge: -0.029154 -0.157203 -0.158065 -0.151333 -0.280290 -0.270200 -0.369359 -0.339296 -0.340970 -0.342049 -0.118647 -0.131975 0.289029 0.134781 -0.024832 0.348305 -0.298356 -0.299479 0.032610 -0.110712 0.274922 -0.158497 0.308806 -0.138336 0.365217 0.048938 -0.203959 -0.112123 0.537908 0.040886 -0.146783 -0.174197 0.099301 0.122149 0.101721 0.102048 0.106653 0.107557 0.104802 0.135138 0.112299 0.126691 0.124691 0.122953 0.114656 0.092479 0.099739 0.112865 0.102443 0.086228
qa: -0.0292 -0.1572 -0.1581 -0.1513 -0.2803 -0.2702 -0.3694 -0.3393 -0.3410 -0.3420 -0.1186 -0.1320 0.2890 0.1348 -0.0248 0.3483 -0.2984 -0.2995 0.0326 -0.1107 0.2749 -0.1585 0.3088 -0.1383 0.3652 0.0489 -0.2040 -0.1121 0.5379 0.0409 -0.1468 -0.1742 0.0993 0.1221 0.1017 0.1020 0.1067 0.1076 0.1048 0.1351 0.1123 0.1267 0.1247 0.1230 0.1147 0.0925 0.0997 0.1129 0.1024 0.0862
va: 1.2918 1.1531 1.1486 1.1607 2.1485 2.1304 2.1417 2.1687 2.1772 2.1337 3.0724 3.3077 3.8466 3.6646 3.9697 4.2744 3.9407 3.9249 3.7267 4.2050 4.2845 3.8332 4.2234 4.1676 4.1886 4.0322 3.8603 4.0394 4.4144 3.9180 3.8429 3.9747 1.0049 1.0192 1.0147 1.0069 1.0088 1.0123 1.0415 1.0248 1.0156 0.9906 1.0211 1.0045 1.0224 1.0126 0.9936 1.0152 1.0068 1.0144
dispcorr: -0.027330176 hartree
energy: -2093.811039063921
dipole: 38.20373 -40.23985 -2.03611 14.04731 -13.95613 0.09118 10.58717 -9.61775 0.96942
magnitude: 2.25696 au
magnitude: 5.73673 debye
