program: Orca
programVersion: 5.0.2
elementType: Cl F F F O O O O O O N N C C C C C C C C C C C C C C C C C C C C H H H H H H H H H H H H H H H H H H
charge: 0
multiplicity: 1
keywords: wb97x-d3
keywords: def2-TZVPP
keywords: def2/J RIJCOSX
keywords: DEFGRID2
keywords: scfconv7
keywords: smallprint printgap noloewdin
keywords: NOSOSCF
formula: C20H18ClF3N2O6
InChI: InChI=1/C20H18ClF3N2O6/c1-5-8-31-17(29)19(2,3)32-16(28)12-9-11(6-7-13(12)21)26-15(27)10-14(20(22,23)24)25(4)18(26)30/h5-7,9-10H,1,8H2,2-4H3
50 atoms
Cl 3.4908 -3.592612 0.206487
F  -5.440411 2.161529 -0.296096
F  -5.879359 1.030184 -2.061671
F  -6.492225 0.280071 -0.147775
O  2.827224 0.52318 -1.053576
O  3.152587 1.948381 1.132902
O  -1.767399 -0.446128 1.793765
O  -1.848852 -1.627396 -2.582779
O  5.259066 2.475248 0.587687
O  4.087118 -0.721036 0.31392
N  -1.810445 -1.04689 -0.386976
N  -3.602693 0.135283 0.583468
C  3.802511 1.572841 -1.106244
C  -0.525366 -1.651001 -0.237281
C  -4.195395 0.195339 -0.655469
C  -2.348841 -0.450045 0.7394
C  3.084224 2.735826 -1.787127
C  5.027836 1.15753 -1.906492
C  1.8762 -1.430936 -0.224218
C  0.607692 -0.878878 -0.379224
C  -2.388623 -1.073409 -1.661054
C  -3.653161 -0.370667 -1.742214
C  4.187397 2.023587 0.304707
C  -0.417661 -3.003632 0.026837
C  3.064487 -0.536365 -0.281097
C  1.976574 -2.796584 0.047295
C  -4.172714 0.736763 1.789165
C  0.833177 -3.575597 0.15795
C  -5.515054 0.925354 -0.790681
C  3.365509 2.319975 2.486497
C  2.145502 2.021551 3.288973
C  1.048477 1.405694 2.874271
H  3.743979 3.600585 -1.844592
H  2.802202 2.459081 -2.803122
H  2.184069 3.025651 -1.24595
H  5.677106 2.016452 -2.063499
H  5.60952 0.386974 -1.408121
H  4.716949 0.788479 -2.883922
H  0.506277 0.174288 -0.599992
H  -4.123998 -0.322541 -2.710143
H  -1.305237 -3.613529 0.126871
H  -3.960858 1.802809 1.841326
H  -5.242843 0.572164 1.837101
H  -3.723274 0.25867 2.650998
H  0.928372 -4.634329 0.351906
H  3.610075 3.385519 2.549359
H  4.224648 1.777774 2.894153
H  2.215454 2.349505 4.321279
H  0.223882 1.224354 3.548248
H  0.922436 1.044817 1.864217
totalener: -2093.78468924 hartree
nucrepener: 3586.05243695 hartree
electener: -5679.83712620 hartree
twoeener: 4329.03795736 hartree
kineticenergy: 2086.91447317 hartree
xcener: -168.854791673694 hartree
chargesum: -0.0000000
charge: -0.025653 -0.157198 -0.150777 -0.158009 -0.281604 -0.264056 -0.384305 -0.337704 -0.340293 -0.336595 -0.115394 -0.129624 0.293838 0.184257 -0.024515 0.356876 -0.297220 -0.293984 0.087823 -0.199041 0.276454 -0.158716 0.288284 -0.153579 0.337629 0.044838 -0.202728 -0.105007 0.538954 0.087646 -0.150203 -0.214507 0.107672 0.103460 0.107227 0.100359 0.122796 0.099345 0.115770 0.134757 0.112082 0.127704 0.123867 0.121890 0.114085 0.094152 0.101136 0.102666 0.111062 0.084084
qa: -0.0257 -0.1572 -0.1508 -0.1580 -0.2816 -0.2641 -0.3843 -0.3377 -0.3403 -0.3366 -0.1154 -0.1296 0.2938 0.1843 -0.0245 0.3569 -0.2972 -0.2940 0.0878 -0.1990 0.2765 -0.1587 0.2883 -0.1536 0.3376 0.0448 -0.2027 -0.1050 0.5390 0.0876 -0.1502 -0.2145 0.1077 0.1035 0.1072 0.1004 0.1228 0.0993 0.1158 0.1348 0.1121 0.1277 0.1239 0.1219 0.1141 0.0942 0.1011 0.1027 0.1111 0.0841
va: 1.2955 1.1531 1.1619 1.1488 2.1352 2.1373 2.1154 2.1710 2.1797 2.1391 3.0696 3.3101 3.8645 3.6226 3.9657 4.2501 3.9222 3.9388 3.6555 4.1937 4.2808 3.8370 4.2302 4.1906 4.2331 4.0539 3.8667 4.0261 4.4134 3.8632 3.8911 3.9718 1.0087 1.0065 1.0120 1.0135 1.0183 1.0055 1.0361 1.0246 1.0159 0.9903 1.0059 1.0187 1.0225 0.9975 0.9987 1.0070 1.0116 1.0234
dispcorr: -0.029156539 hartree
energy: -2093.813845780061
dipole: 29.53028 -31.68249 -2.15221 17.77207 -17.09018 0.68189 8.52796 -8.24021 0.28775
magnitude: 2.27592 au
magnitude: 5.78492 debye
