program: Orca
programVersion: 5.0.2
elementType: Cl F F F O O O O O O N N C C C C C C C C C C C C C C C C C C C C H H H H H H H H H H H H H H H H H H
charge: 0
multiplicity: 1
keywords: wb97x-d3
keywords: def2-TZVPP
keywords: def2/J RIJCOSX
keywords: DEFGRID2
keywords: scfconv7
keywords: smallprint printgap noloewdin
keywords: NOSOSCF
formula: C20H18ClF3N2O6
InChI: InChI=1/C20H18ClF3N2O6/c1-5-8-31-17(29)19(2,3)32-16(28)12-9-11(6-7-13(12)21)26-15(27)10-14(20(22,23)24)25(4)18(26)30/h5-7,9-10H,1,8H2,2-4H3
50 atoms
Cl 3.316261 -2.297468 0.623386
F  -7.137743 -0.378801 0.27424
F  -6.662844 1.291247 -1.008194
F  -6.970341 -0.657243 -1.844307
O  3.474252 0.12855 -0.893357
O  4.425192 1.377538 1.230901
O  -2.398023 0.142322 1.677716
O  -2.329782 -1.983441 -2.326459
O  5.086907 3.132943 0.007559
O  1.981743 1.71081 -0.378493
N  -2.350675 -0.893265 -0.333367
N  -4.311054 0.158401 0.448297
C  4.530338 1.074795 -1.110819
C  -0.974747 -1.213852 -0.126587
C  -4.973305 -0.31466 -0.65911
C  -2.977203 -0.177328 0.673245
C  4.310542 1.863772 -2.391822
C  5.796335 0.225351 -1.205212
C  1.348193 -0.560991 -0.188636
C  -0.002024 -0.26713 -0.363522
C  -2.952413 -1.35813 -1.507326
C  -4.361013 -1.033053 -1.610577
C  4.685966 2.006975 0.093875
C  -0.619683 -2.479123 0.30492
C  2.293785 0.554415 -0.480795
C  1.696062 -1.834478 0.265347
C  -4.943572 0.958731 1.496329
C  0.711538 -2.783495 0.507828
C  -6.450559 -0.011579 -0.808544
C  4.496273 2.135835 2.444827
C  5.898305 2.286631 2.936332
C  6.324068 1.765769 4.078524
H  4.169966 1.175237 -3.225296
H  3.44899 2.523662 -2.330627
H  5.184351 2.475914 -2.606398
H  5.948141 -0.367032 -0.303988
H  5.729634 -0.453484 -2.0554
H  6.665344 0.865638 -1.35094
H  -0.28049 0.724563 -0.693498
H  -4.883628 -1.4002 -2.47821
H  -1.378717 -3.226336 0.493037
H  -5.614028 1.695739 1.069352
H  -5.484056 0.334019 2.204866
H  -4.166226 1.487568 2.034454
H  0.994519 -3.763434 0.864527
H  3.895034 1.576334 3.160519
H  4.030523 3.112219 2.29367
H  6.570097 2.875828 2.322583
H  7.33733 1.912836 4.426394
H  5.67614 1.17486 4.714795
totalener: -2093.78430994 hartree
nucrepener: 3478.87133935 hartree
electener: -5572.65564929 hartree
oneelecener: -9794.84591552 hartree
twoeener: 4222.19026623 hartree
kineticenergy: 2086.90400328 hartree
xcener: -168.849891334221 hartree
chargesum: 0.0000000
charge: -0.047635 -0.157696 -0.157580 -0.151355 -0.274517 -0.259316 -0.367607 -0.341214 -0.354689 -0.365763 -0.121600 -0.131840 0.302019 0.135760 -0.023977 0.350343 -0.297542 -0.295969 0.008308 -0.081647 0.276266 -0.159870 0.307210 -0.139582 0.383836 0.037912 -0.202745 -0.111942 0.538172 0.057112 -0.172172 -0.194623 0.099734 0.118668 0.101261 0.111821 0.102613 0.105607 0.116896 0.134332 0.113911 0.124204 0.126025 0.123975 0.114740 0.093719 0.101717 0.133341 0.105127 0.086253
qa: -0.0476 -0.1577 -0.1576 -0.1514 -0.2745 -0.2593 -0.3676 -0.3412 -0.3547 -0.3658 -0.1216 -0.1318 0.3020 0.1358 -0.0240 0.3503 -0.2975 -0.2960 0.0083 -0.0816 0.2763 -0.1599 0.3072 -0.1396 0.3838 0.0379 -0.2027 -0.1119 0.5382 0.0571 -0.1722 -0.1946 0.0997 0.1187 0.1013 0.1118 0.1026 0.1056 0.1169 0.1343 0.1139 0.1242 0.1260 0.1240 0.1147 0.0937 0.1017 0.1333 0.1051 0.0863
va: 1.2667 1.1519 1.1494 1.1605 2.1627 2.1331 2.1421 2.1686 2.1606 2.1269 3.0886 3.3085 3.8501 3.6825 3.9689 4.2706 3.9431 3.9242 3.7577 4.1488 4.2836 3.8331 4.2190 4.1733 4.1723 4.0028 3.8655 4.0425 4.4140 3.8959 3.8459 3.9632 1.0052 1.0181 1.0141 1.0141 1.0069 1.0093 1.0392 1.0248 1.0144 1.0052 0.9906 1.0181 1.0205 1.0046 1.0100 1.0110 1.0092 1.0165
dispcorr: -0.027257470 hartree
energy: -2093.811567411597
dipole: 50.47077 -51.34653 -0.87576 14.62675 -15.15554 -0.52879 9.53752 -8.86455 0.67296
magnitude: 1.22452 au
magnitude: 3.11248 debye
