program: Orca
programVersion: 5.0.2
elementType: Cl F F F O O O O O O N N C C C C C C C C C C C C C C C C C C C C H H H H H H H H H H H H H H H H H H
charge: 0
multiplicity: 1
keywords: wb97x-d3
keywords: def2-TZVPP
keywords: def2/J RIJCOSX
keywords: DEFGRID2
keywords: scfconv7
keywords: smallprint printgap noloewdin
keywords: NOSOSCF
formula: C20H18ClF3N2O6
InChI: InChI=1/C20H18ClF3N2O6/c1-5-8-31-17(29)19(2,3)32-16(28)12-9-11(6-7-13(12)21)26-15(27)10-14(20(22,23)24)25(4)18(26)30/h5-7,9-10H,1,8H2,2-4H3
50 atoms
Cl 3.140317 -3.536761 0.442528
F  -5.574151 2.306999 -1.323495
F  -6.365175 0.563872 -2.285645
F  -6.632124 0.815343 -0.173371
O  2.524253 0.614981 -0.871647
O  3.046897 1.947138 1.350934
O  -1.953961 0.086973 1.505887
O  -2.312537 -2.090237 -2.456838
O  5.109901 2.482205 0.65379
O  3.804022 -0.711299 0.393789
N  -2.105516 -0.970727 -0.487675
N  -3.772603 0.543025 0.219154
C  3.527066 1.637036 -0.945026
C  -0.835284 -1.578534 -0.25009
C  -4.469021 0.269138 -0.9336
C  -2.567577 -0.102461 0.488691
C  2.804742 2.842523 -1.543606
C  4.686044 1.20963 -1.833103
C  1.566926 -1.367042 -0.11841
C  0.309061 -0.815697 -0.349903
C  -2.770792 -1.297863 -1.674982
C  -4.027553 -0.599638 -1.852928
C  4.018157 2.037655 0.44897
C  -0.748555 -2.923048 0.061807
C  2.765451 -0.483779 -0.158731
C  1.645181 -2.727481 0.189967
C  -4.257066 1.447902 1.262512
C  0.491527 -3.495368 0.269417
C  -5.774588 0.994897 -1.179002
C  3.382969 2.240392 2.711549
C  4.148665 1.125191 3.343838
C  5.32358 1.292365 3.931088
H  3.485884 3.689713 -1.613226
H  2.452448 2.609438 -2.548885
H  1.948212 3.139049 -0.93824
H  4.304827 0.896647 -2.805417
H  5.362824 2.046832 -1.990676
H  5.260035 0.394357 -1.400512
H  0.226172 0.232218 -0.598244
H  -4.576173 -0.807345 -2.756571
H  -1.640957 -3.528842 0.138769
H  -4.614736 2.380064 0.838054
H  -5.04519 0.985286 1.853482
H  -3.427989 1.675736 1.92117
H  0.569698 -4.548399 0.49867
H  2.41685 2.370287 3.201426
H  3.931842 3.182012 2.779787
H  3.685226 0.14497 3.315557
H  5.840685 0.469795 4.405362
H  5.820292 2.254301 3.947568
totalener: -2093.78353645 hartree
nucrepener: 3534.64820108 hartree
electener: -5628.43173752 hartree
oneelecener: -9906.38268714 hartree
twoeener: 4277.95094962 hartree
kineticenergy: 2086.91344453 hartree
xcener: -168.853086755520 hartree
chargesum: -0.0000000
charge: -0.025816 -0.158374 -0.151127 -0.157383 -0.284507 -0.268000 -0.370174 -0.339491 -0.340379 -0.347144 -0.121425 -0.129454 0.290387 0.158302 -0.026875 0.344570 -0.304707 -0.295916 0.015119 -0.122209 0.270369 -0.153823 0.305090 -0.143571 0.387837 0.031925 -0.208686 -0.105291 0.540544 0.040397 -0.147502 -0.175446 0.109350 0.101920 0.107786 0.098238 0.101635 0.122709 0.111754 0.134553 0.117388 0.125149 0.127546 0.125220 0.114376 0.101146 0.092464 0.112959 0.102315 0.086250
qa: -0.0258 -0.1584 -0.1511 -0.1574 -0.2845 -0.2680 -0.3702 -0.3395 -0.3404 -0.3471 -0.1214 -0.1295 0.2904 0.1583 -0.0269 0.3446 -0.3047 -0.2959 0.0151 -0.1222 0.2704 -0.1538 0.3051 -0.1436 0.3878 0.0319 -0.2087 -0.1053 0.5405 0.0404 -0.1475 -0.1754 0.1093 0.1019 0.1078 0.0982 0.1016 0.1227 0.1118 0.1346 0.1174 0.1251 0.1275 0.1252 0.1144 0.1011 0.0925 0.1130 0.1023 0.0863
va: 1.2945 1.1492 1.1614 1.1522 2.1416 2.1301 2.1419 2.1705 2.1789 2.1268 3.1074 3.3033 3.8408 3.7009 3.9673 4.2715 3.9212 3.9387 3.7290 4.1801 4.2831 3.8255 4.2249 4.1609 4.1781 4.0502 3.8531 4.0256 4.4102 3.9174 3.8421 3.9753 1.0092 1.0063 1.0121 1.0053 1.0143 1.0182 1.0398 1.0245 1.0136 1.0033 0.9909 1.0237 1.0224 0.9934 1.0119 1.0162 1.0068 1.0143
dispcorr: -0.027450865 hartree
energy: -2093.810987310027
dipole: 38.13738 -40.13060 -1.99322 18.13039 -17.23059 0.89980 11.19672 -10.95854 0.23818
magnitude: 2.19984 au
magnitude: 5.59154 debye
