program: Orca
programVersion: 5.0.2
elementType: Cl F F F O O O O O O N N C C C C C C C C C C C C C C C C C C C C H H H H H H H H H H H H H H H H H H
charge: 0
multiplicity: 1
keywords: wb97x-d3
keywords: def2-TZVPP
keywords: def2/J RIJCOSX
keywords: DEFGRID2
keywords: scfconv7
keywords: smallprint printgap noloewdin
keywords: NOSOSCF
formula: C20H18ClF3N2O6
InChI: InChI=1/C20H18ClF3N2O6/c1-5-8-31-17(29)19(2,3)32-16(28)12-9-11(6-7-13(12)21)26-15(27)10-14(20(22,23)24)25(4)18(26)30/h5-7,9-10H,1,8H2,2-4H3
50 atoms
Cl 3.379458 -2.600452 0.324368
F  -6.576857 1.317657 -0.073529
F  -6.640965 0.432975 -2.024518
F  -7.061934 -0.773765 -0.303635
O  3.638364 -0.014593 -0.87698
O  4.729879 1.018238 1.31488
O  -2.416993 -0.783691 1.816441
O  -2.027606 -0.908629 -2.698327
O  5.308973 2.8831 0.215957
O  2.211786 1.553973 -0.171867
N  -2.223948 -0.864439 -0.434586
N  -4.280047 -0.33076 0.591382
C  4.710985 0.922637 -1.046527
C  -0.860377 -1.262529 -0.285086
C  -4.823599 -0.153452 -0.658524
C  -2.934707 -0.664246 0.73751
C  4.469363 1.818707 -2.251108
C  5.951957 0.057904 -1.255269
C  1.485293 -0.697573 -0.254751
C  0.14822 -0.329242 -0.38572
C  -2.720747 -0.715345 -1.733438
C  -4.114827 -0.321418 -1.783263
C  4.921958 1.749459 0.22467
C  -0.55593 -2.588954 -0.037303
C  2.476384 0.405933 -0.40932
C  1.780655 -2.032678 0.025327
C  -5.015969 -0.106376 1.835784
C  0.760579 -2.968641 0.13091
C  -6.289282 0.213713 -0.764733
C  4.882519 1.662675 2.585173
C  3.65843 2.432091 2.959189
C  2.93461 2.1596 4.035118
H  3.624802 2.487841 -2.108069
H  5.349073 2.429797 -2.443552
H  4.287722 1.203322 -3.132456
H  5.847126 -0.533989 -2.164491
H  6.832915 0.689518 -1.363668
H  6.11171 -0.62251 -0.420118
H  -0.091426 0.708757 -0.571894
H  -4.548433 -0.18674 -2.760314
H  -1.344094 -3.325796 0.038627
H  -5.096661 0.95499 2.062232
H  -6.004549 -0.549217 1.791306
H  -4.470913 -0.585087 2.639922
H  1.004255 -3.997869 0.351922
H  5.76128 2.311327 2.569282
H  5.063147 0.855343 3.294046
H  3.382137 3.253892 2.308848
H  2.06421 2.746119 4.294521
H  3.181217 1.340743 4.700209
totalener: -2093.78449024 hartree
nucrepener: 3508.26977135 hartree
electener: -5602.05426158 hartree
oneelecener: -9853.78927537 hartree
twoeener: 4251.73501379 hartree
kineticenergy: 2086.90788563 hartree
xcener: -168.851020798180 hartree
chargesum: 0.0000000
charge: -0.049166 -0.157172 -0.151022 -0.159120 -0.274794 -0.258551 -0.370056 -0.339635 -0.351088 -0.369603 -0.120533 -0.131002 0.299636 0.134724 -0.024445 0.348142 -0.298296 -0.299858 0.006216 -0.076668 0.279347 -0.161187 0.302490 -0.143358 0.405007 0.038563 -0.204906 -0.112468 0.539242 0.042800 -0.152711 -0.192873 0.118618 0.100757 0.100875 0.101796 0.105978 0.110574 0.114204 0.134338 0.113239 0.127068 0.123298 0.124707 0.114277 0.099258 0.095545 0.131033 0.103431 0.083349
qa: -0.0492 -0.1572 -0.1510 -0.1591 -0.2748 -0.2586 -0.3701 -0.3396 -0.3511 -0.3696 -0.1205 -0.1310 0.2996 0.1347 -0.0244 0.3481 -0.2983 -0.2999 0.0062 -0.0767 0.2793 -0.1612 0.3025 -0.1434 0.4050 0.0386 -0.2049 -0.1125 0.5392 0.0428 -0.1527 -0.1929 0.1186 0.1008 0.1009 0.1018 0.1060 0.1106 0.1142 0.1343 0.1132 0.1271 0.1233 0.1247 0.1143 0.0993 0.0955 0.1310 0.1034 0.0833
va: 1.2648 1.1533 1.1613 1.1474 2.1676 2.1372 2.1397 2.1706 2.1619 2.1189 3.0790 3.3101 3.8459 3.6748 3.9674 4.2750 3.9454 3.9304 3.7780 4.1598 4.2828 3.8329 4.2275 4.1738 4.1339 4.0022 3.8587 4.0457 4.4131 3.9037 3.8332 3.9659 1.0187 1.0138 1.0051 1.0072 1.0081 1.0139 1.0407 1.0250 1.0147 0.9907 1.0045 1.0216 1.0207 1.0108 1.0028 1.0137 1.0095 1.0164
dispcorr: -0.027672163 hartree
energy: -2093.812162399256
dipole: 43.74584 -44.77960 -1.03376 11.95603 -12.79073 -0.83471 10.55674 -9.92057 0.63617
magnitude: 1.47313 au
magnitude: 3.74439 debye
