program: Orca
programVersion: 5.0.2
elementType: Cl F F F O O O O O O N N C C C C C C C C C C C C C C C C C C C C H H H H H H H H H H H H H H H H H H
charge: 0
multiplicity: 1
keywords: wb97x-d3
keywords: def2-TZVPP
keywords: def2/J RIJCOSX
keywords: DEFGRID2
keywords: scfconv7
keywords: smallprint printgap noloewdin
keywords: NOSOSCF
formula: C20H18ClF3N2O6
InChI: InChI=1/C20H18ClF3N2O6/c1-5-8-31-17(29)19(2,3)32-16(28)12-9-11(6-7-13(12)21)26-15(27)10-14(20(22,23)24)25(4)18(26)30/h5-7,9-10H,1,8H2,2-4H3
50 atoms
Cl 3.424355 -2.367352 0.289514
F  -6.980408 -0.316421 0.515507
F  -6.601392 1.404289 -0.732709
F  -6.933736 -0.520055 -1.617182
O  3.587268 0.220056 -0.930891
O  4.727591 1.404206 1.168848
O  -2.212585 0.125488 1.724227
O  -2.295478 -1.714499 -2.421303
O  5.185362 3.231806 -0.037431
O  2.131111 1.75867 -0.222091
N  -2.241575 -0.783459 -0.348048
N  -4.16756 0.223383 0.569087
C  4.612367 1.192901 -1.183033
C  -0.865494 -1.137717 -0.204632
C  -4.8759 -0.188605 -0.533888
C  -2.82848 -0.129664 0.723665
C  4.285886 2.02212 -2.415301
C  5.87995 0.36986 -1.401871
C  1.466937 -0.513218 -0.243949
C  0.117814 -0.182952 -0.353148
C  -2.886452 -1.157287 -1.532566
C  -4.30017 -0.837916 -1.554966
C  4.842294 2.087082 0.037393
C  -0.521756 -2.447535 0.077862
C  2.423729 0.614507 -0.443843
C  1.801495 -1.835679 0.050735
C  -4.747746 0.979868 1.678655
C  0.808385 -2.791711 0.21306
C  -6.362654 0.098281 -0.591343
C  4.941618 2.11152 2.380341
C  4.821775 1.177801 3.534814
C  4.548064 -0.117176 3.484228
H  4.083979 1.360129 -3.257578
H  3.427552 2.6714 -2.263198
H  5.134626 2.650329 -2.677801
H  5.767808 -0.265079 -2.280648
H  6.729414 1.030986 -1.569499
H  6.097977 -0.265574 -0.544554
H  -0.15134 0.843208 -0.563142
H  -4.858081 -1.158111 -2.419349
H  -1.288114 -3.200828 0.200095
H  -5.232826 0.324703 2.39949
H  -3.948524 1.508034 2.184679
H  -5.455836 1.715806 1.316252
H  1.082769 -3.809454 0.450681
H  4.212125 2.923031 2.472063
H  5.93121 2.580697 2.377453
H  4.983057 1.653011 4.497194
H  4.488801 -0.699497 4.393353
H  4.374703 -0.645176 2.557171
totalener: -2093.78491097 hartree
nucrepener: 3508.23309537 hartree
electener: -5602.01800634 hartree
oneelecener: -9853.45330469 hartree
twoeener: 4251.43529835 hartree
kineticenergy: 2086.89165682 hartree
xcener: -168.850607447246 hartree
chargesum: 0.0000000
charge: -0.059498 -0.157616 -0.157274 -0.151354 -0.273193 -0.259283 -0.365413 -0.340987 -0.343160 -0.363709 -0.123249 -0.132028 0.295514 0.139273 -0.022686 0.349951 -0.299758 -0.296016 0.019568 -0.085191 0.275063 -0.162286 0.293300 -0.140265 0.386578 0.036989 -0.198951 -0.107840 0.538261 0.087757 -0.156441 -0.212345 0.101337 0.118584 0.101336 0.102354 0.106055 0.110762 0.119052 0.133929 0.115369 0.126267 0.123496 0.122048 0.117786 0.102022 0.093420 0.101918 0.101206 0.089348
qa: -0.0595 -0.1576 -0.1573 -0.1514 -0.2732 -0.2593 -0.3654 -0.3410 -0.3432 -0.3637 -0.1232 -0.1320 0.2955 0.1393 -0.0227 0.3500 -0.2998 -0.2960 0.0196 -0.0852 0.2751 -0.1623 0.2933 -0.1403 0.3866 0.0370 -0.1990 -0.1078 0.5383 0.0878 -0.1564 -0.2123 0.1013 0.1186 0.1013 0.1024 0.1061 0.1108 0.1191 0.1339 0.1154 0.1263 0.1235 0.1220 0.1178 0.1020 0.0934 0.1019 0.1012 0.0893
va: 1.2519 1.1523 1.1493 1.1608 2.1591 2.1462 2.1436 2.1686 2.1761 2.1293 3.0971 3.3080 3.8755 3.6936 3.9654 4.2698 3.9427 3.9280 3.7479 4.1418 4.2839 3.8343 4.2231 4.1768 4.1651 3.9897 3.8692 4.0468 4.4149 3.8631 3.8841 3.9703 1.0048 1.0178 1.0142 1.0070 1.0090 1.0134 1.0386 1.0248 1.0135 0.9906 1.0161 1.0063 1.0182 0.9970 0.9999 1.0073 1.0083 1.0302
dispcorr: -0.028160582 hartree
energy: -2093.813071550064
dipole: 47.36530 -48.27888 -0.91358 11.35745 -11.90230 -0.54485 8.25933 -7.71342 0.54592
magnitude: 1.19562 au
magnitude: 3.03904 debye
