program: Orca
programVersion: 5.0.2
elementType: Cl F F F O O O O O O N N C C C C C C C C C C C C C C C C C C C C H H H H H H H H H H H H H H H H H H
charge: 0
multiplicity: 1
keywords: wb97x-d3
keywords: def2-TZVPP
keywords: def2/J RIJCOSX
keywords: DEFGRID2
keywords: scfconv7
keywords: smallprint printgap noloewdin
keywords: NOSOSCF
formula: C20H18ClF3N2O6
InChI: InChI=1/C20H18ClF3N2O6/c1-5-8-31-17(29)19(2,3)32-16(28)12-9-11(6-7-13(12)21)26-15(27)10-14(20(22,23)24)25(4)18(26)30/h5-7,9-10H,1,8H2,2-4H3
50 atoms
Cl 3.160739 -1.920234 -1.67755
F  -6.981251 1.093775 -0.045635
F  -7.258372 -0.987396 0.396306
F  -6.64355 0.38564 1.94643
O  3.359752 -0.372871 0.729556
O  4.510502 1.552591 -0.653986
O  -2.340686 -2.095104 1.463026
O  -2.586815 0.72559 -2.075399
O  5.257613 2.570031 1.199705
O  1.986764 1.386919 0.86863
N  -2.465797 -0.702142 -0.312919
N  -4.348389 -1.110655 1.045984
C  4.448637 0.314546 1.360386
C  -1.100286 -0.989522 -0.615714
C  -5.048898 -0.191375 0.301623
C  -3.001827 -1.353758 0.784504
C  5.65159 -0.604957 1.160313
C  4.178206 0.539286 2.840168
C  1.245685 -0.557042 -0.257461
C  -0.093824 -0.281493 0.003353
C  -3.133826 0.210858 -1.135157
C  -4.506101 0.456892 -0.738332
C  4.760687 1.631545 0.647315
C  -0.79054 -1.97074 -1.540024
C  2.231015 0.271604 0.494321
C  1.549676 -1.543417 -1.197064
C  -4.909346 -1.834057 2.187436
C  0.531365 -2.237841 -1.836502
C  -6.496341 0.078972 0.657053
C  4.864094 2.681193 -1.461595
C  6.300718 2.613902 -1.864965
C  7.20629 3.510513 -1.503164
H  5.484024 -1.55631 1.665277
H  5.83074 -0.804182 0.104669
H  6.54477 -0.147754 1.583714
H  3.920629 -0.409422 3.311786
H  5.07125 0.925174 3.327578
H  3.372064 1.247874 3.011618
H  -0.338429 0.498532 0.711468
H  -5.060242 1.174357 -1.320714
H  -1.577612 -2.522677 -2.035697
H  -5.918146 -2.171109 1.977129
H  -4.296158 -2.708531 2.367851
H  -4.904254 -1.222805 3.087707
H  0.780655 -2.988963 -2.572228
H  4.641994 3.613505 -0.940979
H  4.212069 2.611132 -2.332665
H  6.586859 1.776293 -2.493121
H  8.235416 3.438841 -1.827829
H  6.953651 4.345987 -0.863184
totalener: -2093.78367964 hartree
nucrepener: 3476.52436853 hartree
electener: -5570.30804818 hartree
oneelecener: -9790.30113002 hartree
twoeener: 4219.99308184 hartree
kineticenergy: 2086.92192376 hartree
xcener: -168.852937848103 hartree
chargesum: -0.0000000
charge: -0.049898 -0.150968 -0.158577 -0.157324 -0.274798 -0.261763 -0.371708 -0.338707 -0.347564 -0.364310 -0.118876 -0.130785 0.294101 0.130341 -0.022759 0.349835 -0.294215 -0.300721 0.017281 -0.075922 0.280485 -0.162612 0.315992 -0.146243 0.379641 0.041558 -0.201249 -0.109854 0.537827 0.057333 -0.190970 -0.164285 0.101967 0.106135 0.107740 0.099659 0.101923 0.118442 0.113576 0.134110 0.112049 0.122245 0.123224 0.126617 0.114270 0.095236 0.100081 0.113155 0.103452 0.095832
qa: -0.0499 -0.1510 -0.1586 -0.1573 -0.2748 -0.2618 -0.3717 -0.3387 -0.3476 -0.3643 -0.1189 -0.1308 0.2941 0.1303 -0.0228 0.3498 -0.2942 -0.3007 0.0173 -0.0759 0.2805 -0.1626 0.3160 -0.1462 0.3796 0.0416 -0.2012 -0.1099 0.5378 0.0573 -0.1910 -0.1643 0.1020 0.1061 0.1077 0.0997 0.1019 0.1184 0.1136 0.1341 0.1120 0.1222 0.1232 0.1266 0.1143 0.0952 0.1001 0.1132 0.1035 0.0958
va: 1.2648 1.1613 1.1473 1.1533 2.1598 2.1365 2.1385 2.1706 2.1714 2.1316 3.0715 3.3096 3.8473 3.6670 3.9646 4.2742 3.9257 3.9413 3.7636 4.1599 4.2833 3.8372 4.2253 4.1818 4.1718 4.0023 3.8645 4.0439 4.4151 3.8974 3.8576 3.9514 1.0073 1.0146 1.0096 1.0051 1.0144 1.0187 1.0402 1.0251 1.0161 1.0052 1.0190 0.9905 1.0209 1.0154 0.9979 1.0085 1.0061 1.0157
dispcorr: -0.027462117 hartree
energy: -2093.811141760030
dipole: 52.59881 -53.39444 -0.79562 7.21634 -8.35203 -1.13569 6.35412 -6.27867 0.07545
magnitude: 1.38871 au
magnitude: 3.52981 debye
