program: Orca
programVersion: 5.0.2
elementType: Cl F F F O O O O O O N N C C C C C C C C C C C C C C C C C C C C H H H H H H H H H H H H H H H H H H
charge: 0
multiplicity: 1
keywords: wb97x-d3
keywords: def2-TZVPP
keywords: def2/J RIJCOSX
keywords: DEFGRID2
keywords: scfconv7
keywords: smallprint printgap noloewdin
keywords: NOSOSCF
formula: C20H18ClF3N2O6
InChI: InChI=1/C20H18ClF3N2O6/c1-5-8-31-17(29)19(2,3)32-16(28)12-9-11(6-7-13(12)21)26-15(27)10-14(20(22,23)24)25(4)18(26)30/h5-7,9-10H,1,8H2,2-4H3
50 atoms
Cl 3.349642 -1.851037 -1.675484
F  -6.960865 0.767995 -0.40207
F  -7.030238 -1.046917 0.728726
F  -6.436774 0.800139 1.677678
O  3.484905 -0.39722 0.80374
O  4.79444 1.478405 -0.517793
O  -2.153014 -1.988099 1.431955
O  -2.468036 0.645684 -2.242325
O  5.594896 2.404879 1.360533
O  2.12386 1.369899 0.949165
N  -2.303859 -0.664554 -0.393958
N  -4.149946 -0.971025 1.040944
C  4.558169 0.247484 1.500907
C  -0.934092 -0.942186 -0.685584
C  -4.898149 -0.182209 0.199351
C  -2.820999 -1.263123 0.742515
C  5.717798 -0.743092 1.398112
C  4.211546 0.510524 2.95927
C  1.404258 -0.53054 -0.259693
C  0.060216 -0.257838 -0.021637
C  -3.001445 0.16859 -1.274862
C  -4.388024 0.37676 -0.906611
C  5.007187 1.530354 0.793908
C  -0.605505 -1.891777 -1.636087
C  2.372601 0.264041 0.547173
C  1.727921 -1.484932 -1.225174
C  -4.684059 -1.617649 2.239612
C  0.722468 -2.151509 -1.91256
C  -6.346451 0.084314 0.554116
C  5.392996 2.483572 -1.328068
C  4.598102 3.738508 -1.472161
C  3.39452 3.991146 -0.98373
H  5.459003 -1.672881 1.904898
H  5.95508 -0.97517 0.360495
H  6.605186 -0.331499 1.876395
H  3.442452 1.268637 3.076925
H  3.870524 -0.41426 3.425349
H  5.097464 0.847564 3.493392
H  -0.19819 0.498813 0.706612
H  -4.977225 1.00058 -1.558205
H  -1.381825 -2.425763 -2.167039
H  -5.25124 -2.511893 1.988406
H  -3.849584 -1.90947 2.8652
H  -5.305563 -0.935642 2.808583
H  0.986326 -2.876956 -2.668626
H  5.517073 2.015879 -2.307577
H  6.392725 2.723693 -0.954759
H  5.103992 4.494346 -2.065584
H  2.92229 4.945929 -1.168255
H  2.836492 3.284722 -0.386877
totalener: -2093.78310903 hartree
nucrepener: 3510.59277357 hartree
electener: -5604.37588260 hartree
oneelecener: -9858.30892094 hartree
twoeener: 4253.93303833 hartree
kineticenergy: 2086.90845386 hartree
xcener: -168.854059045853 hartree
chargesum: 0.0000000
charge: -0.049075 -0.151251 -0.157781 -0.157870 -0.273558 -0.261247 -0.371742 -0.337981 -0.336921 -0.392146 -0.121567 -0.130660 0.313321 0.140129 -0.024807 0.349134 -0.294159 -0.301840 0.030350 -0.086829 0.278196 -0.159454 0.268783 -0.143843 0.402399 0.035566 -0.204378 -0.108303 0.538973 0.061872 -0.154009 -0.208543 0.102434 0.109026 0.107751 0.120568 0.099471 0.103702 0.113287 0.133975 0.113844 0.125756 0.125111 0.123985 0.114618 0.105098 0.092648 0.097477 0.097092 0.123397
qa: -0.0491 -0.1513 -0.1578 -0.1579 -0.2736 -0.2612 -0.3717 -0.3380 -0.3369 -0.3921 -0.1216 -0.1307 0.3133 0.1401 -0.0248 0.3491 -0.2942 -0.3018 0.0304 -0.0868 0.2782 -0.1595 0.2688 -0.1438 0.4024 0.0356 -0.2044 -0.1083 0.5390 0.0619 -0.1540 -0.2085 0.1024 0.1090 0.1078 0.1206 0.0995 0.1037 0.1133 0.1340 0.1138 0.1258 0.1251 0.1240 0.1146 0.1051 0.0926 0.0975 0.0971 0.1234
va: 1.2665 1.1612 1.1523 1.1492 2.1699 2.1428 2.1386 2.1715 2.1761 2.0919 3.0831 3.3084 3.8347 3.6785 3.9654 4.2732 3.9214 3.9408 3.7558 4.1572 4.2837 3.8318 4.2435 4.1793 4.1114 4.0083 3.8593 4.0424 4.4138 3.8895 3.8340 3.9622 1.0075 1.0125 1.0105 1.0184 1.0043 1.0152 1.0411 1.0247 1.0149 0.9905 1.0211 1.0047 1.0205 0.9941 1.0123 1.0093 1.0114 1.0179
dispcorr: -0.028243801 hartree
energy: -2093.811352832890
dipole: 45.90349 -46.77202 -0.86853 8.29385 -9.50113 -1.20728 8.63767 -8.50788 0.12980
magnitude: 1.49289 au
magnitude: 3.79463 debye
