program: Orca
programVersion: 5.0.2
elementType: Cl F F F O O O O O O N N C C C C C C C C C C C C C C C C C C C C H H H H H H H H H H H H H H H H H H
charge: 0
multiplicity: 1
keywords: wb97x-d3
keywords: def2-TZVPP
keywords: def2/J RIJCOSX
keywords: DEFGRID2
keywords: scfconv7
keywords: smallprint printgap noloewdin
keywords: NOSOSCF
formula: C20H18ClF3N2O6
InChI: InChI=1/C20H18ClF3N2O6/c1-5-8-31-17(29)19(2,3)32-16(28)12-9-11(6-7-13(12)21)26-15(27)10-14(20(22,23)24)25(4)18(26)30/h5-7,9-10H,1,8H2,2-4H3
50 atoms
Cl 3.282774 -2.354202 -1.156429
F  -6.695217 -0.422615 2.221578
F  -6.720296 1.05133 0.667395
F  -7.178522 -1.009214 0.21656
O  3.567682 -0.183647 0.635363
O  4.319704 1.832679 -0.935299
O  -2.647238 -0.335751 -1.988845
O  -2.008002 -1.653146 2.300853
O  4.93752 3.056259 0.835115
O  2.001705 1.396177 0.803468
N  -2.331149 -1.010214 0.145394
N  -4.445203 -0.269354 -0.592521
C  4.602614 0.687883 1.113554
C  -0.968498 -1.308093 -0.160009
C  -4.929588 -0.482988 0.676671
C  -3.107376 -0.521627 -0.892807
C  5.901509 -0.048094 0.793111
C  4.468009 0.922665 2.609597
C  1.373387 -0.734621 -0.006772
C  0.031218 -0.451268 0.242783
C  -2.760267 -1.239211 1.457468
C  -4.160789 -0.937702 1.675408
C  4.610279 2.012396 0.345648
C  -0.65225 -2.470289 -0.840357
C  2.338271 0.279443 0.509773
C  1.681591 -1.902445 -0.709277
C  -5.252606 0.288542 -1.678122
C  0.667668 -2.757607 -1.122676
C  -6.395255 -0.210715 0.946937
C  4.268008 2.994835 -1.772025
C  5.627322 3.460652 -2.180072
C  6.055651 3.435682 -3.43413
H  6.756757 0.5502 1.105032
H  5.936199 -0.994995 1.331728
H  5.992029 -0.255173 -0.272245
H  3.570029 1.480285 2.863778
H  4.447594 -0.035573 3.128799
H  5.32331 1.485722 2.977337
H  -0.216262 0.460229 0.769237
H  -4.546594 -1.105921 2.667162
H  -1.432108 -3.150168 -1.155722
H  -5.465162 1.342007 -1.51059
H  -4.685558 0.198185 -2.595805
H  -6.180832 -0.260036 -1.798942
H  0.920248 -3.654912 -1.669009
H  3.721891 3.789996 -1.25954
H  3.689087 2.68781 -2.642257
H  6.264824 3.852791 -1.396186
H  7.035825 3.803334 -3.705124
H  5.442898 3.053572 -4.241808
totalener: -2093.78450344 hartree
nucrepener: 3469.83294550 hartree
electener: -5563.61744895 hartree
oneelecener: -9776.82829872 hartree
twoeener: 4213.21084977 hartree
kineticenergy: 2086.90893151 hartree
xcener: -168.852056118898 hartree
chargesum: -0.0000000
charge: -0.046278 -0.151420 -0.157057 -0.159239 -0.275379 -0.261880 -0.372071 -0.338488 -0.355409 -0.375368 -0.122281 -0.127251 0.301957 0.141922 -0.028149 0.346261 -0.302763 -0.300506 -0.027270 -0.078081 0.276066 -0.155493 0.314831 -0.139604 0.422144 0.036252 -0.214226 -0.113672 0.541984 0.055671 -0.173689 -0.195972 0.106025 0.102323 0.112997 0.119489 0.100092 0.102060 0.122074 0.135547 0.115235 0.128141 0.126141 0.126975 0.114870 0.101490 0.094065 0.135173 0.104853 0.086910
qa: -0.0463 -0.1514 -0.1571 -0.1592 -0.2754 -0.2619 -0.3721 -0.3385 -0.3554 -0.3754 -0.1223 -0.1273 0.3020 0.1419 -0.0281 0.3463 -0.3028 -0.3005 -0.0273 -0.0781 0.2761 -0.1555 0.3148 -0.1396 0.4221 0.0363 -0.2142 -0.1137 0.5420 0.0557 -0.1737 -0.1960 0.1060 0.1023 0.1130 0.1195 0.1001 0.1021 0.1221 0.1355 0.1152 0.1281 0.1261 0.1270 0.1149 0.1015 0.0941 0.1352 0.1049 0.0869
va: 1.2655 1.1610 1.1516 1.1487 2.1703 2.1361 2.1409 2.1717 2.1599 2.1192 3.0925 3.3009 3.8547 3.6853 3.9744 4.2762 3.9195 3.9461 3.7857 4.1440 4.2819 3.8315 4.2083 4.1732 4.1416 4.0032 3.8475 4.0448 4.4067 3.8980 3.8433 3.9621 1.0092 1.0069 1.0160 1.0174 1.0051 1.0134 1.0418 1.0242 1.0135 0.9919 1.0268 1.0011 1.0208 1.0095 1.0038 1.0110 1.0092 1.0163
dispcorr: -0.026943077 hartree
energy: -2093.811446519379
dipole: 49.35153 -50.31774 -0.96621 16.46174 -17.01387 -0.55213 -8.29173 7.31214 -0.97959
magnitude: 1.48257 au
magnitude: 3.76838 debye
