program: Orca
programVersion: 5.0.2
elementType: Cl F F F O O O O O O N N C C C C C C C C C C C C C C C C C C C C H H H H H H H H H H H H H H H H H H
charge: 0
multiplicity: 1
keywords: wb97x-d3
keywords: def2-TZVPP
keywords: def2/J RIJCOSX
keywords: DEFGRID2
keywords: scfconv7
keywords: smallprint printgap noloewdin
keywords: NOSOSCF
formula: C20H18ClF3N2O6
InChI: InChI=1/C20H18ClF3N2O6/c1-5-8-31-17(29)19(2,3)32-16(28)12-9-11(6-7-13(12)21)26-15(27)10-14(20(22,23)24)25(4)18(26)30/h5-7,9-10H,1,8H2,2-4H3
50 atoms
Cl 3.325825 -3.035668 -1.629883
F  -6.644489 -0.164775 0.989263
F  -5.675756 1.661038 1.612357
F  -6.33732 1.42091 -0.414427
O  2.588026 0.10876 1.280784
O  3.281061 2.389403 0.118106
O  -1.954166 -1.8549 1.622022
O  -2.061116 0.257458 -2.387366
O  5.339756 2.281166 0.998238
O  3.964274 -0.461147 -0.387072
N  -1.992528 -0.78238 -0.368738
N  -3.773699 -0.567329 1.163285
C  3.599254 0.897366 1.922707
C  -0.700485 -1.313732 -0.667745
C  -4.432852 0.212995 0.243143
C  -2.531978 -1.124736 0.86044
C  4.677767 0.017641 2.536807
C  2.858176 1.674303 3.008125
C  1.696475 -1.202986 -0.421402
C  0.422998 -0.716419 -0.13671
C  -2.602481 0.01912 -1.339258
C  -3.911087 0.509651 -0.954946
C  4.202605 1.909237 0.944512
C  -0.578221 -2.416544 -1.493038
C  2.885109 -0.498255 0.13218
C  1.81013 -2.317556 -1.254371
C  -4.330895 -0.928236 2.467168
C  0.675763 -2.918932 -1.780828
C  -5.787541 0.78396 0.611355
C  3.704885 3.328598 -0.878877
C  4.287725 2.635042 -2.065247
C  3.765586 2.719951 -3.280125
H  5.351352 0.621854 3.141395
H  4.215536 -0.724137 3.188464
H  5.274772 -0.495258 1.787592
H  3.549814 2.330485 3.535075
H  2.055655 2.282389 2.592347
H  2.427943 0.985121 3.734974
H  0.31276 0.148821 0.501101
H  -4.430384 1.125326 -1.670718
H  -1.457548 -2.887737 -1.910553
H  -5.080532 -1.711788 2.376162
H  -3.524027 -1.301466 3.085791
H  -4.759988 -0.063635 2.961673
H  0.780422 -3.785679 -2.417559
H  4.419805 4.032123 -0.446267
H  2.805079 3.877469 -1.155337
H  5.186297 2.0526 -1.897357
H  4.21984 2.223983 -4.126598
H  2.865156 3.288702 -3.479053
totalener: -2093.78449896 hartree
nucrepener: 3534.87141374 hartree
electener: -5628.65591271 hartree
oneelecener: -9906.81849346 hartree
twoeener: 4278.16258075 hartree
kineticenergy: 2086.90178214 hartree
xcener: -168.849490482738 hartree
chargesum: -0.0000000
charge: -0.028689 -0.157358 -0.158313 -0.151309 -0.282640 -0.265908 -0.369405 -0.338878 -0.348618 -0.344467 -0.121778 -0.130786 0.290231 0.142792 -0.024669 0.346871 -0.295721 -0.300417 0.028839 -0.113972 0.274816 -0.159383 0.306300 -0.138609 0.377565 0.046656 -0.206338 -0.112006 0.538657 0.043097 -0.154384 -0.192360 0.099873 0.099910 0.121736 0.106191 0.107584 0.102350 0.106403 0.134899 0.113370 0.126784 0.124954 0.124380 0.114224 0.100102 0.094821 0.133446 0.104527 0.084631
qa: -0.0287 -0.1574 -0.1583 -0.1513 -0.2826 -0.2659 -0.3694 -0.3389 -0.3486 -0.3445 -0.1218 -0.1308 0.2902 0.1428 -0.0247 0.3469 -0.2957 -0.3004 0.0288 -0.1140 0.2748 -0.1594 0.3063 -0.1386 0.3776 0.0467 -0.2063 -0.1120 0.5387 0.0431 -0.1544 -0.1924 0.0999 0.0999 0.1217 0.1062 0.1076 0.1023 0.1064 0.1349 0.1134 0.1268 0.1250 0.1244 0.1142 0.1001 0.0948 0.1334 0.1045 0.0846
va: 1.2918 1.1528 1.1483 1.1609 2.1465 2.1290 2.1417 2.1701 2.1639 2.1304 3.0860 3.3055 3.8503 3.6755 3.9690 4.2738 3.9415 3.9261 3.7312 4.1995 4.2838 3.8302 4.2240 4.1655 4.1821 4.0349 3.8566 4.0384 4.4137 3.8999 3.8320 3.9664 1.0132 1.0050 1.0194 1.0082 1.0127 1.0066 1.0409 1.0247 1.0146 0.9909 1.0224 1.0036 1.0227 1.0116 1.0029 1.0126 1.0096 1.0162
dispcorr: -0.027285006 hartree
energy: -2093.811783971097
dipole: 35.61045 -37.71347 -2.10303 12.66787 -12.49642 0.17145 9.21327 -8.27284 0.94043
magnitude: 2.31009 au
magnitude: 5.87179 debye
