program: Orca
programVersion: 5.0.2
elementType: Cl F F F O O O O O O N N C C C C C C C C C C C C C C C C C C C C H H H H H H H H H H H H H H H H H H
charge: 0
multiplicity: 1
keywords: wb97x-d3
keywords: def2-TZVPP
keywords: def2/J RIJCOSX
keywords: DEFGRID2
keywords: scfconv7
keywords: smallprint printgap noloewdin
keywords: NOSOSCF
formula: C20H18ClF3N2O6
InChI: InChI=1/C20H18ClF3N2O6/c1-5-8-31-17(29)19(2,3)32-16(28)12-9-11(6-7-13(12)21)26-15(27)10-14(20(22,23)24)25(4)18(26)30/h5-7,9-10H,1,8H2,2-4H3
50 atoms
Cl 3.232662 -1.879474 -1.681334
F  -7.057347 -1.254163 0.965659
F  -6.658792 0.799227 1.504295
F  -7.182578 0.292534 -0.511886
O  3.389655 -0.30035 0.702212
O  4.548414 1.792872 -0.466476
O  -2.147674 -1.673825 1.669233
O  -2.73789 0.151801 -2.443589
O  5.067254 2.696916 1.515564
O  1.963651 1.410569 0.877762
N  -2.426647 -0.743848 -0.375651
N  -4.210066 -0.86275 1.16536
C  4.424191 0.380337 1.425752
C  -1.054238 -1.005733 -0.669853
C  -5.034556 -0.317223 0.210789
C  -2.874821 -1.135309 0.876453
C  5.677105 -0.458476 1.184747
C  4.094275 0.449741 2.908681
C  1.282309 -0.528812 -0.295541
C  -0.064392 -0.270447 -0.054036
C  -3.204914 -0.148121 -1.37519
C  -4.592274 0.041393 -1.00202
C  4.685148 1.775114 0.851504
C  -0.718647 -1.995071 -1.577043
C  2.241912 0.31226 0.47598
C  1.611809 -1.520292 -1.221736
C  -4.664959 -1.268101 2.495329
C  0.610539 -2.238531 -1.861512
C  -6.497886 -0.1178 0.547081
C  4.788237 3.032837 -1.144019
C  6.246585 3.284508 -1.347646
C  6.819114 3.298057 -2.543112
H  6.532286 -0.004889 1.684139
H  5.540423 -1.460806 1.590598
H  5.901128 -0.545824 0.122545
H  3.236496 1.085805 3.112449
H  3.888365 -0.552876 3.283584
H  4.942129 0.847802 3.462129
H  -0.325156 0.514737 0.642219
H  -5.241483 0.473129 -1.745692
H  -1.48878 -2.572682 -2.06975
H  -5.173378 -2.229686 2.466209
H  -3.796152 -1.362778 3.134904
H  -5.318698 -0.519017 2.927791
H  0.878891 -2.993919 -2.586058
H  4.324796 3.85086 -0.588601
H  4.276722 2.934171 -2.100669
H  6.836727 3.477925 -0.459182
H  7.874251 3.501171 -2.664701
H  6.256056 3.109615 -3.449304
totalener: -2093.78470946 hartree
nucrepener: 3471.37357051 hartree
electener: -5565.15827997 hartree
oneelecener: -9779.86934954 hartree
twoeener: 4214.71106957 hartree
kineticenergy: 2086.90706004 hartree
xcener: -168.851478377531 hartree
chargesum: -0.0000000
charge: -0.047505 -0.157863 -0.157779 -0.151204 -0.274909 -0.258758 -0.371155 -0.340360 -0.355763 -0.370251 -0.123652 -0.129471 0.299234 0.146547 -0.024705 0.347858 -0.299574 -0.300812 -0.002941 -0.086419 0.274315 -0.159392 0.312805 -0.138916 0.408705 0.026486 -0.205424 -0.113405 0.540048 0.055945 -0.175333 -0.193789 0.104698 0.102166 0.112792 0.118435 0.100503 0.101992 0.120001 0.134869 0.118124 0.125946 0.124886 0.125556 0.115173 0.101626 0.093765 0.134678 0.104977 0.087248
qa: -0.0475 -0.1579 -0.1578 -0.1512 -0.2749 -0.2588 -0.3712 -0.3404 -0.3558 -0.3703 -0.1237 -0.1295 0.2992 0.1465 -0.0247 0.3479 -0.2996 -0.3008 -0.0029 -0.0864 0.2743 -0.1594 0.3128 -0.1389 0.4087 0.0265 -0.2054 -0.1134 0.5400 0.0559 -0.1753 -0.1938 0.1047 0.1022 0.1128 0.1184 0.1005 0.1020 0.1200 0.1349 0.1181 0.1259 0.1249 0.1256 0.1152 0.1016 0.0938 0.1347 0.1050 0.0872
va: 1.2661 1.1511 1.1500 1.1611 2.1658 2.1378 2.1398 2.1706 2.1596 2.1251 3.1158 3.3058 3.8564 3.7095 3.9681 4.2704 3.9232 3.9453 3.7696 4.1256 4.2833 3.8301 4.2154 4.1596 4.1416 4.0142 3.8587 4.0423 4.4106 3.8976 3.8443 3.9628 1.0094 1.0068 1.0150 1.0177 1.0051 1.0140 1.0384 1.0245 1.0128 0.9911 1.0206 1.0042 1.0199 1.0102 1.0041 1.0101 1.0092 1.0164
dispcorr: -0.027056534 hartree
energy: -2093.811765993559
dipole: 52.10975 -52.89216 -0.78240 9.82403 -10.79036 -0.96634 6.82597 -6.67849 0.14748
magnitude: 1.25208 au
magnitude: 3.18254 debye
