program: Orca
programVersion: 5.0.2
elementType: Cl F F F O O O O O O N N C C C C C C C C C C C C C C C C C C C C H H H H H H H H H H H H H H H H H H
charge: 0
multiplicity: 1
keywords: wb97x-d3
keywords: def2-TZVPP
keywords: def2/J RIJCOSX
keywords: DEFGRID2
keywords: scfconv7
keywords: smallprint printgap noloewdin
keywords: NOSOSCF
formula: C20H18ClF3N2O6
InChI: InChI=1/C20H18ClF3N2O6/c1-5-8-31-17(29)19(2,3)32-16(28)12-9-11(6-7-13(12)21)26-15(27)10-14(20(22,23)24)25(4)18(26)30/h5-7,9-10H,1,8H2,2-4H3
50 atoms
Cl 3.468371 -3.186558 -0.840463
F  -5.774629 2.168133 -0.310171
F  -6.715217 0.245758 -0.314544
F  -5.993693 1.098678 1.533911
O  3.917844 -0.459948 0.073309
O  3.438315 2.113704 -0.210994
O  -2.646901 -2.619591 0.89603
O  -1.249841 0.965165 -1.509523
O  4.821238 2.644468 1.467516
O  2.57251 0.158709 1.747462
N  -1.934018 -0.829617 -0.288438
N  -4.136113 -0.929758 0.561633
C  4.954436 0.443739 0.489356
C  -0.635105 -1.415138 -0.399854
C  -4.375145 0.30952 0.016464
C  -2.888492 -1.539092 0.425824
C  5.928868 0.479412 -0.684623
C  5.644503 -0.046799 1.751969
C  1.725447 -1.295771 0.089443
C  0.428987 -0.812478 0.23754
C  -2.128466 0.417303 -0.892627
C  -3.449936 0.972739 -0.689882
C  4.387791 1.855673 0.677771
C  -0.428418 -2.548086 -1.167524
C  2.782201 -0.476399 0.748699
C  1.921669 -2.447719 -0.669465
C  -5.14557 -1.683139 1.307225
C  0.844703 -3.073982 -1.281475
C  -5.729516 0.958605 0.233989
C  2.757456 3.36814 -0.108866
C  1.620851 3.3358 -1.072512
C  1.399264 4.279202 -1.976049
H  6.7442 1.169664 -0.471233
H  6.356793 -0.509945 -0.846717
H  5.437628 0.796171 -1.603716
H  6.503056 0.583613 1.975423
H  4.987358 -0.031222 2.617759
H  6.0042 -1.064386 1.598866
H  0.270143 0.065102 0.849033
H  -3.638937 1.943417 -1.117045
H  -1.254014 -3.030699 -1.671895
H  -6.027234 -1.862531 0.698413
H  -4.716753 -2.640641 1.574567
H  -5.425561 -1.169533 2.222737
H  1.008444 -3.974192 -1.856318
H  3.441232 4.192735 -0.324957
H  2.396183 3.49703 0.915733
H  0.934769 2.49902 -0.991491
H  0.540275 4.236761 -2.630983
H  2.06126 5.128358 -2.09561
totalener: -2093.78530215 hartree
nucrepener: 3550.08429357 hartree
electener: -5643.86959572 hartree
oneelecener: -9937.12217159 hartree
twoeener: 4293.25257587 hartree
kineticenergy: 2086.88783575 hartree
xcener: -168.847707694788 hartree
chargesum: -0.0000000
charge: -0.048035 -0.151475 -0.157877 -0.157413 -0.271384 -0.261598 -0.371847 -0.361607 -0.342869 -0.365259 -0.122566 -0.122398 0.300354 0.187643 -0.026745 0.346029 -0.291129 -0.295595 0.063517 -0.172681 0.289093 -0.159420 0.286139 -0.138164 0.383518 0.028245 -0.221286 -0.113289 0.544697 0.058717 -0.151237 -0.217246 0.099658 0.098834 0.114798 0.102077 0.119673 0.099135 0.123662 0.135530 0.117381 0.129456 0.127751 0.130806 0.116189 0.093068 0.102647 0.128999 0.109054 0.084455
qa: -0.0480 -0.1515 -0.1579 -0.1574 -0.2714 -0.2616 -0.3718 -0.3616 -0.3429 -0.3653 -0.1226 -0.1224 0.3004 0.1876 -0.0267 0.3460 -0.2911 -0.2956 0.0635 -0.1727 0.2891 -0.1594 0.2861 -0.1382 0.3835 0.0282 -0.2213 -0.1133 0.5447 0.0587 -0.1512 -0.2172 0.0997 0.0988 0.1148 0.1021 0.1197 0.0991 0.1237 0.1355 0.1174 0.1295 0.1278 0.1308 0.1162 0.0931 0.1026 0.1290 0.1091 0.0845
va: 1.2678 1.1614 1.1504 1.1508 2.1647 2.1299 2.1444 2.1382 2.1761 2.1333 3.1311 3.2977 3.8602 3.6672 3.9876 4.2687 3.9236 3.9418 3.7265 4.1557 4.2474 3.8451 4.2373 4.1546 4.1675 4.0186 3.8412 4.0355 4.4040 3.8605 3.8837 3.9871 1.0080 1.0073 1.0156 1.0142 1.0172 1.0056 1.0346 1.0246 1.0134 0.9962 1.0290 0.9951 1.0185 1.0063 0.9995 1.0019 1.0086 1.0137
dispcorr: -0.028300586 hartree
energy: -2093.813602738299
dipole: 36.58897 -38.12159 -1.53262 10.36069 -10.91435 -0.55366 -0.59824 -0.11461 -0.71285
magnitude: 1.77866 au
magnitude: 4.52099 debye
