program: Orca
programVersion: 5.0.2
elementType: Cl F F F O O O O O O N N C C C C C C C C C C C C C C C C C C C C H H H H H H H H H H H H H H H H H H
charge: 0
multiplicity: 1
keywords: wb97x-d3
keywords: def2-TZVPP
keywords: def2/J RIJCOSX
keywords: DEFGRID2
keywords: scfconv7
keywords: smallprint printgap noloewdin
keywords: NOSOSCF
formula: C20H18ClF3N2O6
InChI: InChI=1/C20H18ClF3N2O6/c1-5-8-31-17(29)19(2,3)32-16(28)12-9-11(6-7-13(12)21)26-15(27)10-14(20(22,23)24)25(4)18(26)30/h5-7,9-10H,1,8H2,2-4H3
50 atoms
Cl 3.409895 -3.69109 0.62286
F  -6.14749 1.072248 0.157287
F  -5.065481 2.532698 -1.01181
F  -5.953402 0.83283 -1.965587
O  3.094745 0.169996 -1.103585
O  2.778244 1.964047 0.746935
O  -1.528082 0.062478 1.755795
O  -2.015205 -1.991534 -2.256992
O  4.934751 2.565572 0.694773
O  4.019362 -0.727607 0.731142
N  -1.737301 -0.925335 -0.269255
N  -3.306576 0.668113 0.477569
C  4.026116 1.262585 -1.12594
C  -0.494846 -1.596827 -0.058107
C  -4.035289 0.444322 -0.666596
C  -2.147226 -0.05953 0.730362
C  3.485853 2.217611 -2.187853
C  5.431373 0.805954 -1.483988
C  1.910155 -1.516989 -0.021072
C  0.68354 -0.905356 -0.251719
C  -2.428631 -1.194643 -1.455584
C  -3.653246 -0.434022 -1.603366
C  3.998988 1.988151 0.223459
C  -0.469086 -2.9238 0.328964
C  3.138968 -0.680011 -0.079754
C  1.929953 -2.85363 0.371203
C  -3.711748 1.594684 1.535318
C  0.744577 -3.555875 0.52893
C  -5.314092 1.227772 -0.872628
C  2.604529 2.491983 2.0657
C  1.21212 2.164667 2.483465
C  0.354627 3.062028 2.947031
H  2.468236 2.536689 -1.965222
H  4.118508 3.102039 -2.249231
H  3.488498 1.732865 -3.164121
H  5.406599 0.254575 -2.424158
H  6.077537 1.671103 -1.619135
H  5.873401 0.174847 -0.718117
H  0.653458 0.132011 -0.555185
H  -4.228559 -0.604443 -2.498264
H  -1.391345 -3.469712 0.473122
H  -4.115753 2.509663 1.118956
H  -4.440499 1.140422 2.203913
H  -2.833101 1.853484 2.11303
H  0.774319 -4.597191 0.816068
H  2.786127 3.569343 2.074621
H  3.331887 2.025232 2.736208
H  0.918798 1.121745 2.423126
H  -0.630971 2.770162 3.281968
H  0.605176 4.113065 3.024044
totalener: -2093.78473489 hartree
nucrepener: 3605.17850819 hartree
electener: -5698.96324308 hartree
twoeener: 4347.94377343 hartree
kineticenergy: 2086.91645536 hartree
xcener: -168.850798678738 hartree
chargesum: 0.0000000
charge: -0.032659 -0.156771 -0.158429 -0.150709 -0.279042 -0.268015 -0.389564 -0.338078 -0.335630 -0.332934 -0.119419 -0.127939 0.297825 0.195428 -0.025862 0.362589 -0.290354 -0.287399 0.104136 -0.195190 0.274345 -0.155991 0.281493 -0.155468 0.316307 0.033446 -0.195226 -0.102001 0.538696 0.067798 -0.157469 -0.226430 0.106975 0.105593 0.102919 0.097940 0.100223 0.122552 0.108457 0.134745 0.113893 0.123479 0.128199 0.111947 0.116295 0.092818 0.107813 0.135701 0.108946 0.090016
qa: -0.0327 -0.1568 -0.1584 -0.1507 -0.2790 -0.2680 -0.3896 -0.3381 -0.3356 -0.3329 -0.1194 -0.1279 0.2978 0.1954 -0.0259 0.3626 -0.2904 -0.2874 0.1041 -0.1952 0.2743 -0.1560 0.2815 -0.1555 0.3163 0.0334 -0.1952 -0.1020 0.5387 0.0678 -0.1575 -0.2264 0.1070 0.1056 0.1029 0.0979 0.1002 0.1226 0.1085 0.1347 0.1139 0.1235 0.1282 0.1119 0.1163 0.0928 0.1078 0.1357 0.1089 0.0900
va: 1.2889 1.1535 1.1491 1.1621 2.1483 2.1130 2.1124 2.1720 2.1839 2.1450 3.0953 3.3141 3.8443 3.6267 3.9627 4.2455 3.9269 3.9383 3.6374 4.1755 4.2822 3.8305 4.2387 4.1805 4.2578 4.0477 3.8763 4.0191 4.4146 3.8679 3.8662 3.9807 1.0114 1.0078 1.0070 1.0055 1.0133 1.0196 1.0443 1.0244 1.0150 1.0079 0.9917 1.0174 1.0197 1.0070 0.9989 1.0097 1.0069 1.0152
dispcorr: -0.029598836 hartree
energy: -2093.814333721499
dipole: 28.86738 -30.86578 -1.99840 19.09370 -18.25217 0.84153 6.47590 -6.54433 -0.06843
magnitude: 2.16944 au
magnitude: 5.51427 debye
