program: Orca
programVersion: 5.0.2
elementType: Cl F F F O O O O O O N N C C C C C C C C C C C C C C C C C C C C H H H H H H H H H H H H H H H H H H
charge: 0
multiplicity: 1
keywords: wb97x-d3
keywords: def2-TZVPP
keywords: def2/J RIJCOSX
keywords: DEFGRID2
keywords: scfconv7
keywords: smallprint printgap noloewdin
keywords: NOSOSCF
formula: C20H18ClF3N2O6
InChI: InChI=1/C20H18ClF3N2O6/c1-5-8-31-17(29)19(2,3)32-16(28)12-9-11(6-7-13(12)21)26-15(27)10-14(20(22,23)24)25(4)18(26)30/h5-7,9-10H,1,8H2,2-4H3
50 atoms
Cl 3.310888 -2.920443 0.667496
F  -6.932093 -0.435504 -0.425499
F  -6.355104 1.64192 -0.313857
F  -6.383702 0.63428 -2.202984
O  2.434727 1.16719 -0.597578
O  4.383381 1.453194 1.141256
O  -2.372764 -0.498834 1.881847
O  -1.83066 -0.982874 -2.595187
O  5.797509 2.216651 -0.41665
O  3.849205 -0.536413 -0.900771
N  -2.108299 -0.785136 -0.346788
N  -4.162579 -0.049695 0.553631
C  3.442262 2.137017 -0.914238
C  -0.788481 -1.280466 -0.116416
C  -4.653792 0.055793 -0.725585
C  -2.844519 -0.443571 0.776492
C  2.834329 3.476125 -0.50371
C  3.779059 2.129569 -2.397423
C  1.603369 -0.975564 -0.22384
C  0.307303 -0.499126 -0.415509
C  -2.547572 -0.693142 -1.672761
C  -3.915183 -0.232008 -1.805707
C  4.694776 1.914552 -0.062547
C  -0.614411 -2.554586 0.395042
C  2.76239 -0.124627 -0.610632
C  1.768156 -2.256054 0.309845
C  -4.923366 0.316481 1.748577
C  0.66044 -3.033727 0.61886
C  -6.09483 0.48207 -0.91731
C  5.445112 1.139508 2.027768
C  4.903799 0.408999 3.208706
C  3.652411 0.013045 3.388092
H  1.94768 3.685776 -1.102595
H  2.549926 3.482221 0.547763
H  3.550747 4.278872 -0.673214
H  4.446302 2.956976 -2.631129
H  4.268808 1.210599 -2.709305
H  2.867042 2.257951 -2.981323
H  0.157449 0.493378 -0.814721
H  -4.306557 -0.152769 -2.806322
H  -1.470562 -3.17348 0.627033
H  -5.937902 -0.062322 1.698431
H  -4.440652 -0.133935 2.606988
H  -4.939008 1.395177 1.892743
H  0.803908 -4.020058 1.036144
H  5.953562 2.05591 2.345747
H  6.194224 0.525503 1.518351
H  5.648793 0.187687 3.966109
H  3.369069 -0.525211 4.28147
H  2.867598 0.203372 2.669573
totalener: -2093.78407856 hartree
nucrepener: 3537.61678160 hartree
electener: -5631.40086016 hartree
oneelecener: -9912.16263284 hartree
twoeener: 4280.76177268 hartree
kineticenergy: 2086.90111894 hartree
xcener: -168.853551028788 hartree
chargesum: -0.0000000
charge: -0.026699 -0.158198 -0.157093 -0.150906 -0.283686 -0.263362 -0.371388 -0.338006 -0.342354 -0.339594 -0.122770 -0.130894 0.291834 0.149157 -0.023448 0.344821 -0.295957 -0.296684 -0.012256 -0.101807 0.273005 -0.160079 0.289756 -0.139659 0.388205 0.040827 -0.202231 -0.104585 0.538915 0.087791 -0.149217 -0.225906 0.095930 0.114351 0.104472 0.103274 0.123115 0.098443 0.109460 0.135088 0.116565 0.123171 0.124575 0.126504 0.115138 0.096392 0.100726 0.102139 0.103564 0.099562
qa: -0.0267 -0.1582 -0.1571 -0.1509 -0.2837 -0.2634 -0.3714 -0.3380 -0.3424 -0.3396 -0.1228 -0.1309 0.2918 0.1492 -0.0234 0.3448 -0.2960 -0.2967 -0.0123 -0.1018 0.2730 -0.1601 0.2898 -0.1397 0.3882 0.0408 -0.2022 -0.1046 0.5389 0.0878 -0.1492 -0.2259 0.0959 0.1144 0.1045 0.1033 0.1231 0.0984 0.1095 0.1351 0.1166 0.1232 0.1246 0.1265 0.1151 0.0964 0.1007 0.1021 0.1036 0.0996
va: 1.2884 1.1490 1.1533 1.1615 2.1202 2.1416 2.1385 2.1727 2.1764 2.1424 3.1052 3.3092 3.8648 3.7148 3.9645 4.2740 3.9229 3.9411 3.7009 4.1720 4.2833 3.8289 4.2302 4.1585 4.1638 4.0239 3.8586 4.0403 4.4148 3.8712 3.8635 3.9750 1.0061 1.0132 1.0090 1.0139 1.0164 1.0047 1.0430 1.0247 1.0125 1.0048 1.0210 0.9907 1.0223 0.9974 1.0007 1.0091 1.0090 1.0191
dispcorr: -0.028430242 hartree
energy: -2093.812508805664
dipole: 36.28926 -38.40773 -2.11847 16.56902 -16.03746 0.53157 11.19047 -10.19298 0.99749
magnitude: 2.40114 au
magnitude: 6.10321 debye
